Export (0) Print
Expand All

HResults Class

Contains all event messages and HRESULTs for the Integration Services runtime, pipeline, stock tasks, and stock transforms.

Object
  Microsoft.SqlServer.Dts.Runtime.HResults

Namespace:  Microsoft.SqlServer.Dts.Runtime
Assembly:  Microsoft.SqlServer.ManagedDTS (in Microsoft.SqlServer.ManagedDTS.dll)

public class HResults

The HResults type exposes the following members.

  NameDescription
Public methodHResultsInitializes a new instance of the HResults class.
Top

  NameDescription
Public methodEquals (Inherited from Object.)
Protected methodFinalize (Inherited from Object.)
Public methodGetHashCode (Inherited from Object.)
Public methodGetType (Inherited from Object.)
Protected methodMemberwiseClone (Inherited from Object.)
Public methodToString (Inherited from Object.)
Top

  NameDescription
Public fieldStatic memberDTS_E_64BITVARIABLERECASTThe variable "%1" is a 64-bit integer variable, which is not supported on this operating system. The variable has been recast to 32-bit integer.
Public fieldStatic memberDTS_E_ABORTTRANSACTIONAborts the connection transaction.
Public fieldStatic memberDTS_E_ACQUIRECONNECTIONWORKINGOFFLINEThe connection from the connection manager acquires to work offline.
Public fieldStatic memberDTS_E_ACQUIREDCONNECTIONISINVALIDThe connection acquired from the connection manager "%1" is not valid.
Public fieldStatic memberDTS_E_ACQUIREDCONNECTIONUNAVAILABLEUnable to access the acquired connections.
Public fieldStatic memberDTS_E_ADDROWTOBUFFERFAILEDThe attempt to add a row to the Data Flow task buffer failed with error code 0x%1!8.8X!.
Public fieldStatic memberDTS_E_ADODESTARGUMENTEXCEPTIONAn argument exception has occurred while data provider tries to insert data to destination. The returned message is : __.
Public fieldStatic memberDTS_E_ADODESTCOLUMNERRORDISPNOTSUPPORTEDInput column error disposition is not supported by ADO NET Destination component.
Public fieldStatic memberDTS_E_ADODESTCOLUMNTRUNDISPNOTSUPPORTEDInput column truncation disposition is not supported by ADO NET Destination component.
Public fieldStatic memberDTS_E_ADODESTCONNECTIONTYPENOTSUPPORTEDFailed to retrieve the provider invariant name from __, it is currently not supported by ADO NET Destination component.
Public fieldStatic memberDTS_E_ADODESTDATATYPENOTSUPPORTEDThe data type "__" found on column "__" is not supported for the __.
Public fieldStatic memberDTS_E_ADODESTERRORUPDATEROWAn error has occurred while sending this row to destination data source.
Public fieldStatic memberDTS_E_ADODESTEXECUTEREADEREXCEPTIONExecuting SQL command throws an exception, the message is : __.
Public fieldStatic memberDTS_E_ADODESTEXTERNALCOLNOTEXISTThe __ does not exist in the database. It may have been removed or renamed.
Public fieldStatic memberDTS_E_ADODESTFAILEDTOACQUIRECONNECTIONADO NET Destination has failed to acquire the connection __. The connection may have been corrupted.
Public fieldStatic memberDTS_E_ADODESTGETSCHEMATABLEFAILEDFailed to get properties of external columns. The table name you entered may not exist, or you do not have SELECT permission on the table object and an alternative attempt to get column properties through connection has failed. Detailed error messages are: __.
Public fieldStatic memberDTS_E_ADODESTINPUTTRUNDISPNOTSUPPORTEDInput truncation row disposition is not supported by ADO NET Destination component.
Public fieldStatic memberDTS_E_ADODESTINSERTIONFAILUREAn exception has occurred during data insertion, the message returned from the provider is: __.
Public fieldStatic memberDTS_E_ADODESTNOERROROUTPUTThe destination component does not have an error output. It may have been corrupted.
Public fieldStatic memberDTS_E_ADODESTNOLINEAGEIDThe lineage ID __ associated with external column __ does not exist at run time.
Public fieldStatic memberDTS_E_ADODESTNOTMANAGEDCONNECTIONThe specified connection __ is not managed, please use managed connection for ADO NET destination.
Public fieldStatic memberDTS_E_ADODESTSQLBULKCOPYCREATIONEXCEPTIONCreating a bulk copy that throws an exception.
Public fieldStatic memberDTS_E_ADODESTTABLENAMEERRORThe Table or View name is not expected. \n\t If you are quoting the table name, please use the prefix __ and the suffix __ of your selected data provider for quotation. \n\t If you are using multipart name, please use at most three parts for the table name.
Public fieldStatic memberDTS_E_ADODESTWRONGBATCHSIZEThe BatchSize property must be a non-negative integer.
Public fieldStatic memberDTS_E_ADOSOURCEFAILEDTOACQUIRECONNECTIONADO NET source has failed to acquire the connection.
Public fieldStatic memberDTS_E_ADOSRCCOLUMNNOTINSCHEMAROWSETThe %1 does not have a matching source column in the DataReader schema.
Public fieldStatic memberDTS_E_ADOSRCDATATYPEMISMATCHThe data type of "%1" does not match the data type "%2" of the source column "%3".
Public fieldStatic memberDTS_E_ADOSRCINVALIDSQLCOMMANDAn error occurred executing the provided SQL command.
Public fieldStatic memberDTS_E_ADOSRCOUTPUTCOLUMNDATATYPECANNOTBECHANGEDThe data type of output columns on the %1 cannot be changed.
Public fieldStatic memberDTS_E_ADOSRCUNKNOWNTYPEMAPPEDTONTEXTThe data type "__" found on column "__" is not supported for the __. This column will be converted to DT_NTEXT.
Public fieldStatic memberDTS_E_ALREADYADDEDThe executable has been added to the Executables collection of another container. This occurs when a client tries to add an executable to more than one Executables collection. You need to remove the executable from the current Executables collection before attempting to add it.
Public fieldStatic memberDTS_E_ALREADYATTACHEDThe %1 is already attached and cannot be attached again. Detach it and try again.
Public fieldStatic memberDTS_E_ALREADYCONNECTEDComponent is already connected. The component needs to be disconnected before attempting to connect it.
Public fieldStatic memberDTS_E_ALREADYEXECUTINGExecute call failed because the executable is already executing. This error occurs when the client calls Execute on a container that is still executing from the last Execute call.
Public fieldStatic memberDTS_E_AMBIGUOUSVARIABLENAMEThe variable name is ambiguous because multiple variables with this name exist in different namespaces. Specify namespace-qualified name to prevent ambiguity.
Public fieldStatic memberDTS_E_ATLEASTONEINPUTMUSTBEMAPPEDTOOUTPUTNo inputs were mapped to an output. The "%1" must have at least one input column mapped to an output column.
Public fieldStatic memberDTS_E_ATTEMPTINGTOINSERTINTOAREADONLYCOLUMNFailure inserting into the read-only column "%1".
Public fieldStatic memberDTS_E_ATTEMPTINGTOINSERTINTOAROWIDCOLUMN"%1" is a row ID column and cannot be included in a data insertion operation.
Public fieldStatic memberDTS_E_ATTEMPTINGTOINSERTINTOAROWVERCOLUMNAttempting insertion into the row version column "%1". Cannot insert into a row version column.
Public fieldStatic memberDTS_E_AXTASK_EMPTY_SCRIPTFunction not found.
Public fieldStatic memberDTS_E_AXTASK_HANDLER_NOT_FOUNDHandler not found.
Public fieldStatic memberDTS_E_AXTASK_INITIALIZATION_WITH_WRONG_XML_ELEMENTActiveX Script Task was initiated with a wrong XML element.
Public fieldStatic memberDTS_E_AXTASK_MISSING_ENTRY_METHOD_NAMEFunction not found.
Public fieldStatic memberDTS_E_AXTASKUTIL_ADDTYPELIB_FAILEDAn error occurred while adding the managed type library to the script host. Verify that the DTS 2000 runtime is installed.
Public fieldStatic memberDTS_E_AXTASKUTIL_ADDVARIABLES_FAILEDAn error occurred while adding the SSIS variables to the script host namespace. This might prevent the task from using SSIS variables in the script.
Public fieldStatic memberDTS_E_AXTASKUTIL_ENUMERATE_LANGUAGES_FAILEDAn error occurred while attempting to retrieve the scripting languages installed on the system.
Public fieldStatic memberDTS_E_AXTASKUTIL_EXECUTION_FAILEDAn error occurred while executing the script. Verify that the script engine for the selected language is installed properly.
Public fieldStatic memberDTS_E_AXTASKUTIL_MSG_BAD_FUNCTIONThe function name entered is not valid. Verify that a valid function name has been specified.
Public fieldStatic memberDTS_E_AXTASKUTIL_SCRIPT_PARSING_FAILEDA fatal error occurred while trying to parse the script text. Verify that the script engine for the chosen language is installed properly.
Public fieldStatic memberDTS_E_AXTASKUTIL_SCRIPTHOST_CREATE_FAILEDAn error occurred while creating the ActiveX script host. Verify that you have the script host installed properly.
Public fieldStatic memberDTS_E_AXTASKUTIL_SCRIPTHOSTINIT_FAILEDAn error occurred while trying to instantiate the script host for the chosen language. Verify that the script language you have chosen is installed on your system.
Public fieldStatic memberDTS_E_BACKPRESSURE_ALLINPUTSCLOSEDAll inputs in the back pressure is closed.
Public fieldStatic memberDTS_E_BACKPRESSURE_BADDEPENDENTCOUNTThe number of bad dependents in the back pressure.
Public fieldStatic memberDTS_E_BACKPRESSURE_DEPENDONEORINPUTThe depend one or input back pressure.
Public fieldStatic memberDTS_E_BEGINTRANSACTIONThe SSIS Runtime has failed to start the distributed transaction due to error 0x%1!8.8X! "%2". The DTC transaction failed to start. This could occur because the MSDTC Service is not running.
Public fieldStatic memberDTS_E_BINARYCODENOTFOUNDThe script component is configured to pre-compile the script, but binary code is not found. Please visit the IDE in Script Component Editor by clicking Design Script button to cause binary code to be generated.
Public fieldStatic memberDTS_E_BITASK_CANNOT_ACQUIRE_CONNECTIONFailed to acquire the specified connection: "%1".
Public fieldStatic memberDTS_E_BITASK_CANNOT_RETRIEVE_COLUMN_INFOAn error occurred while retrieving the columns of the table.
Public fieldStatic memberDTS_E_BITASK_CANNOT_RETRIEVE_TABLESAn error occurred while retrieving the tables from the database.
Public fieldStatic memberDTS_E_BITASK_CANNOTRETAINCONNINTRANSACTIONThe task cannot have a retained connection manager in a transaction.
Public fieldStatic memberDTS_E_BITASK_DATA_FILE_NOT_SPECIFIEDData file name not specified.
Public fieldStatic memberDTS_E_BITASK_DESTINATION_TABLE_NOT_SPECIFIEDYou must specify a table name to continue.
Public fieldStatic memberDTS_E_BITASK_ERROR_IN_DB_OPERATIONAn error occurred in the database operation.
Public fieldStatic memberDTS_E_BITASK_ERROR_IN_LOAD_FROM_XMLError occurred in LoadFromXML at the tag "%1".
Public fieldStatic memberDTS_E_BITASK_ERROR_IN_SAVE_TO_XMLError occurred in SaveToXML at the tag "%1".
Public fieldStatic memberDTS_E_BITASK_EXECUTE_FAILEDExecution failed.
Public fieldStatic memberDTS_E_BITASK_EXECUTION_FAILEDBulk insert execution failed.
Public fieldStatic memberDTS_E_BITASK_HANDLER_NOT_FOUNDHandler not found.
Public fieldStatic memberDTS_E_BITASK_INITIALIZATION_WITH_WRONG_XML_ELEMENTBulk Insert Task was initiated with a wrong XML element.
Public fieldStatic memberDTS_E_BITASK_INVALID_CONNECTIONThe connection is not valid.
Public fieldStatic memberDTS_E_BITASK_INVALIDDESTCONNECTIONNAMEThe destination connection specified is not valid. Supply a valid connection to continue.
Public fieldStatic memberDTS_E_BITASK_INVALIDSOURCECONNECTIONNAMEThe specified connection "%1" is either not valid, or points to an invalid object. To continue, specify a valid connection.
Public fieldStatic memberDTS_E_BITASK_NO_CONNECTION_MANAGER_SPECIFIEDAttempt to obtain the Connection Manager failed.
Public fieldStatic memberDTS_E_BITASK_NULL_CONNECTIONThe connection is null.
Public fieldStatic memberDTS_E_BITASKUNMANCONNECTION_CANNOT_OPEN_FILEError occurred while trying to open the data file.
Public fieldStatic memberDTS_E_BITASKUNMANCONNECTION_CANNOT_RETRIEVE_COLUMN_INFOError occurred while retrieving the columns of the table.
Public fieldStatic memberDTS_E_BITASKUNMANCONNECTION_CANNOT_RETRIEVE_TABLESError occurred while retrieving the tables from the database.
Public fieldStatic memberDTS_E_BITASKUNMANCONNECTION_ERROR_IN_DB_OPERATIONError in database operation.
Public fieldStatic memberDTS_E_BITASKUNMANCONNECTION_EXECUTE_FAILEDExecution failed.
Public fieldStatic memberDTS_E_BITASKUNMANCONNECTION_INVALID_CONNECTIONThe connection is not valid.
Public fieldStatic memberDTS_E_BITASKUNMANCONNECTION_OEM_CONVERSION_FAILEDCannot convert the input OEM file to the specified format.
Public fieldStatic memberDTS_E_BLANKOUTPUTCOLUMNNAMEThe name for "%1" is blank, and names cannot be blank.
Public fieldStatic memberDTS_E_BPDUPLICATEThe specified breakpoint ID already exists. This error occurs when a task calls CreateBreakpoint with the same ID multiple times. It is possible to create a breakpoint with the same ID multiple times if the task calls RemoveBreakpoint on the first creation before creating the second one.
Public fieldStatic memberDTS_E_BPUNKNOWNIDThe specified breakpoint ID does not exist. This error occurs when a task references a breakpoint that does not exist.
Public fieldStatic memberDTS_E_BUFFERALLOCFAILEDA buffer failed while allocating %1!d! bytes.
Public fieldStatic memberDTS_E_BUFFERBADSIZEBuffer Type %1!d! had a size of %2!I64d! bytes.
Public fieldStatic memberDTS_E_BUFFERFAILUREDETAILSThe system reports %1!d! percent memory load. There are %2 bytes of physical memory with %3 bytes free. There are %4 bytes of virtual memory with %5 bytes free. The paging file has %6 bytes with %7 bytes free.
Public fieldStatic memberDTS_E_BUFFERGETTEMPFILENAMEThe buffer manager could not get a temporary file name. The call to GetTempFileName failed.
Public fieldStatic memberDTS_E_BUFFERISEORThis buffer represents the end of the row set and its row count cannot be altered. An attempt was made to call AddRow or RemoveRow on a buffer that has the end of row set flag.
Public fieldStatic memberDTS_E_BUFFERISFLATPrivate mode buffers do not support this operation.
Public fieldStatic memberDTS_E_BUFFERISNOTPRIMEOUTPUTThe method was called on the wrong buffer. Buffers that are not used for component output do not support this operation.
Public fieldStatic memberDTS_E_BUFFERISPRIMEOUTPUTThis operation cannot be called on a buffer passed to PrimeOutput. A call was made to a buffer method during PrimeOutput, but that call is not allowed during PrimeOutput.
Public fieldStatic memberDTS_E_BUFFERISPRIVATEA call was made to a buffer method on a private buffer and private buffers do not support this operation.
Public fieldStatic memberDTS_E_BUFFERISPROCESSINPUTThis operation cannot be called on a buffer passed to ProcessInput. A call was made to a buffer method during ProcessInput, but that call is not allowed during ProcessInput.
Public fieldStatic memberDTS_E_BUFFERISREADONLYThis operation could not be performed because buffer is in read-only mode. A read-only buffer cannot be modified.
Public fieldStatic memberDTS_E_BUFFERLOCKUNDERFLOWThe buffer was already unlocked.
Public fieldStatic memberDTS_E_BUFFERMAXROWSIZEOUTOFRANGEThe default buffer maximum rows must be larger than %1!d! rows. An attempt was made to set the DefaultBufferMaxRows property to a value that is too small.
Public fieldStatic memberDTS_E_BUFFERNOMAPMEMORYAn out-of-memory condition prevents the mapping of a buffer's lineage IDs to DTP_HCOL indexes.
Public fieldStatic memberDTS_E_BUFFERNOOBJECTMEMORYAn out-of-memory condition prevented the creation of the buffer object.
Public fieldStatic memberDTS_E_BUFFERNOTLOCKEDThis buffer is not locked and cannot be manipulated.
Public fieldStatic memberDTS_E_BUFFERORPHANEDThis buffer has been orphaned. The buffer manager has shut down, leaving an outstanding buffer and no cleanup will occur for the buffer. There is a potential for memory leaks and other problems.
Public fieldStatic memberDTS_E_BUFFERSIZEOUTOFRANGEThe default buffer size must be between %1!d! and %2!d! bytes. An attempt was made to set the DefaultBufferSize property to a value that is too small or too large.
Public fieldStatic memberDTS_E_BULKINSERTAPIPREPARATIONFAILEDUnable to prepare the SSIS bulk insert for data insertion.
Public fieldStatic memberDTS_E_BULKINSERTHREADINITIALIZATIONFAILEDThe thread for the SSIS Bulk Insert task failed initialization.
Public fieldStatic memberDTS_E_BULKINSERTTHREADABNORMALCOMPLETIONThe thread for the SSIS Bulk Insert task terminated with errors or warnings.
Public fieldStatic memberDTS_E_BULKINSERTTHREADALREADYRUNNINGThe thread for the SSIS Bulk Insert task is already running.
Public fieldStatic memberDTS_E_BULKINSERTTHREADTERMINATEDThe thread for the SSIS Bulk Insert is no longer running. No more rows can be inserted. Try increasing the bulk insert thread timeout.
Public fieldStatic memberDTS_E_CACHE_DUPLICATE_INDEXPOSThe index position, __, is a duplicate. For non-index columns, the index position should be 0. For index columns, the index position should be a sequential, positive number.
Public fieldStatic memberDTS_E_CACHE_INDEXPOS_NOT_CONTINUOUSCache index positions must be contiguous. For non-index columns, the index position should be 0. For index columns, the index position should be a sequential, positive number.
Public fieldStatic memberDTS_E_CACHE_INVALID_INDEXPOSThe cache index position, __, is not valid. For non-index columns, the index position should be 0. For index columns, the index position should be a sequential, positive number.
Public fieldStatic memberDTS_E_CACHE_TOO_FEW_INDEX_COLUMNSAt least one index column should be specified for the Cache connection manager. To specify an index column, set the Index Position property of the cache column.
Public fieldStatic memberDTS_E_CACHEBADHEADERThe cache file is damaged, or the file was not created by using the Cache connection manager. Provides a valid cache file.
Public fieldStatic memberDTS_E_CACHECOLDATATYPEINCOMPATCannot map the input column, __, and the cache column, "__", because the data types do not match.
Public fieldStatic memberDTS_E_CACHECOLDATATYPEPROPINCOMPATCannot map the input column, "__", and the cache column, "__", because one or more data type properties do not match.
Public fieldStatic memberDTS_E_CACHECOLINDEXPOSMISMATCHThe index position of column, "__", is different from index position of Cache connection manager column, "__".
Public fieldStatic memberDTS_E_CACHECOLUMNMAPPINGFAILEDFailed to map __ to a cache column. The hresult is __.
Public fieldStatic memberDTS_E_CACHECOLUMNOTFOUNDCache column "__" was not found in the cache.
Public fieldStatic memberDTS_E_CACHEFILEWRITEFAILEDThe __ failed to write the cache to file "__". The hresult is __.
Public fieldStatic memberDTS_E_CACHELOADEDFROMFILEThe __ cannot write to the cache because the cache has been loaded from a file by __.
Public fieldStatic memberDTS_E_CACHERELOADEDDIFFERENTFILESThe __ cannot load the cache from file "__" because the cache has already been loaded from file "__".
Public fieldStatic memberDTS_E_CANCELRECEIVEDThe pipeline received a request to cancel and is shutting down.
Public fieldStatic memberDTS_E_CANNOT_MODIFY_PROJECT_PARAMETERS_COLLECTIONCannot modify the project parameters collection.
Public fieldStatic memberDTS_E_CANNOTACCESSDTSAPPLICATIONOBJECTThe Application object cannot be accessed. Verify that SSIS is correctly installed.
Public fieldStatic memberDTS_E_CANNOTACQUIRECONNECTIONFROMCONNECTIONMANAGERSSIS Error Code DTS_E_CANNOTACQUIRECONNECTIONFROMCONNECTIONMANAGER. The AcquireConnection method call to the connection manager "%1" failed with error code 0x%2!8.8X!. There may be error messages posted before this with more information on why the AcquireConnection method call failed.
Public fieldStatic memberDTS_E_CANNOTACQUIREMANAGEDCONNECTIONFROMCONNECTIONMANAGERCannot acquire a managed connection from the run-time connection manager.
Public fieldStatic memberDTS_E_CANNOTCASTTOIDTSOBJECEVERSIONUPDATECannot cast to IDTS object version update.
Public fieldStatic memberDTS_E_CANNOTCHANGEPROTECTIONLEVELSCMCannot change the protection levels of the connection manager.
Public fieldStatic memberDTS_E_CANNOTCLONECONNECTIONMANAGERConnection manager "0x%1" cannot be cloned for out-of-process execution.
Public fieldStatic memberDTS_E_CANNOTCONVERTBETWEENUNICODEANDNONUNICODESTRINGCOLUMNColumn "%1" cannot convert between unicode and non-unicode string data types.
Public fieldStatic memberDTS_E_CANNOTCONVERTBETWEENUNICODEANDNONUNICODESTRINGCOLUMNSColumns "%1" and "%2" cannot convert between unicode and non-unicode string data types.
Public fieldStatic memberDTS_E_CANNOTCONVERTDATATYPESWITHDIFFERENTCODEPAGESConversion from "%1" with code page %2!d! to "%3" with code page %4!d! is not supported.
Public fieldStatic memberDTS_E_CANNOTCONVERTTYPESConversion from "%1" to "%2" is not supported.
Public fieldStatic memberDTS_E_CANNOTCOPYORCONVERTFLATFILEDATACannot copy or convert flat file data for column "%1".
Public fieldStatic memberDTS_E_CANNOTCREATEACCESSORCannot create an OLE DB accessor. Verify that the column metadata is valid.
Public fieldStatic memberDTS_E_CANNOTCREATEBULKINSERTHREADCannot create the bulk insert thread due to error "%1".
Public fieldStatic memberDTS_E_CANNOTFINDRUNTIMECONNECTIONMANAGERThe runtime connection manager with the ID "%1" cannot be found. Verify that the connection manager collection has a connection manager with that ID.
Public fieldStatic memberDTS_E_CANNOTGETCOLUMNNAMECannot get the name of the column with ID %1!d!.
Public fieldStatic memberDTS_E_CANNOTGETIROWSETOpening a row set for "%1" failed. Check that the object exists in the database.
Public fieldStatic memberDTS_E_CANNOTGETIROWSETFASTLOADFailed to open a fastload row set for "%1". Check that the object exists in the database.
Public fieldStatic memberDTS_E_CANNOTGETRUNTIMECONNECTIONMANAGERIDCannot get the ID of the runtime connection manager specified by "%1" in the connection manager collection, Connections, of "%2" due to error code 0x%3!8.8X!. Verify that the ConnectionManager.ID property of the runtime connection object has been set for the component.
Public fieldStatic memberDTS_E_CANNOTHAVEANYINPUTCOLUMNSInput columns not allowed. The number of input columns must be zero.
Public fieldStatic memberDTS_E_CANNOTHAVEINPUTSThis component has %1!d! inputs. No input is allowed on this component.
Public fieldStatic memberDTS_E_CANNOTHAVEZEROINPUTCOLUMNSThe number of input columns for %1 cannot be zero.
Public fieldStatic memberDTS_E_CANNOTHAVEZEROOUTPUTCOLUMNSThe number of output columns for %1 cannot be zero.
Public fieldStatic memberDTS_E_CANNOTLOADCOMPONENTThe managed pipeline component "%1" could not be loaded. The exception was: %2.
Public fieldStatic memberDTS_E_CANNOTLOADOLDPACKAGESThe package cannot be loaded. This occurs when attempting to load an older version package, or the package file refers to an invalid structured object.
Public fieldStatic memberDTS_E_CANNOTMAPINPUTCOLUMNTOOUTPUTCOLUMNCannot find input column with lineage ID "%1!d!" which is needed by "%2". Check SourceInputColumnLineageID custom property of the output column.
Public fieldStatic memberDTS_E_CANNOTMAPOUTPUTCOLUMNThe output column cannot be mapped to an external metadata column.
Public fieldStatic memberDTS_E_CANNOTMAPRUNTIMECONNECTIONMANAGERCannot find the connection manager with ID "%1" in the connection manager collection due to error code 0x%2!8.8X!. That connection manager is needed by "%3" in the connection manager collection of "%4". Verify that a connection manager in the connection manager collection, Connections, has been created with that ID.
Public fieldStatic memberDTS_E_CANNOTOPENDATAFILECannot open the datafile "%1".
Public fieldStatic memberDTS_E_CANNOTOPENREGISTRYKEYThe registry key "%1" cannot be opened.
Public fieldStatic memberDTS_E_CANNOTREATTACHPATHThe "%1" cannot be reattached. Delete the path, add a new one, and attach it.
Public fieldStatic memberDTS_E_CANNOTRETRIEVEBYLINEAGECannot retrieve an item by lineage ID from a collection that does not contain columns.
Public fieldStatic memberDTS_E_CANNOTRETRIEVEPROPERTYFORCOMPONENTCannot retrieve property "%1" from component with ID %2!d!.
Public fieldStatic memberDTS_E_CANNOTTFINDRUNTIMECONNECTIONOBJECTThe connection "%1" cannot be found. Verify that the connection manager has a connection with that name.
Public fieldStatic memberDTS_E_CANNOTUPDATECACHEONINPUTCOLUMNSCannot update the cache on input columns.
Public fieldStatic memberDTS_E_CANNOTWRITETODATAFILECannot write to the data file.
Public fieldStatic memberDTS_E_CANONLYSETCOMPFLAGSONSOURCEThe ComparisonFlags property cannot be set to a non-zero value for "%1" because the "%2" is not a source output. The output column "colname" (ID) cannot have a ComparisonFlags property set to non-zero because its output "outputname" (ID) is not a source output.
Public fieldStatic memberDTS_E_CANONLYSETISSORTEDONSOURCEThe "%1" cannot have its IsSorted property set to TRUE because it is not a source output. A source output has a SynchronousInputID value of zero.
Public fieldStatic memberDTS_E_CANONLYSETSORTKEYONSOURCEThe "%1" cannot have a SortKeyPosition property set to non-zero because "%2" is not a source output. The output column "colname" (ID) cannot have its SortKeyPosition property set to non-zero because its output "outputname" (ID) is not a source output.
Public fieldStatic memberDTS_E_CANTACCESSARRAYDATAThe data in the array cannot be accessed (error: %1). This error can occur wherever GetDataFromSafeArray is called.
Public fieldStatic memberDTS_E_CANTADDBLOBDATALong data was retrieved for a column but cannot be added to the Data Flow task buffer.
Public fieldStatic memberDTS_E_CANTADDCOLUMNThe component does not allow adding columns to this input or output.
Public fieldStatic memberDTS_E_CANTADDINPUTAn input cannot be added to the inputs collection.
Public fieldStatic memberDTS_E_CANTADDOUTPUTAn output cannot be added to the outputs collection.
Public fieldStatic memberDTS_E_CANTADDOUTPUTIDOutput ID %1!d! failed during insert. The new output was not created.
Public fieldStatic memberDTS_E_CANTADDREMOVEWHENEXECUTINGCannot add or remove an element from a package in runtime mode. This error occurs when an attempt is made to add or remove an object from a collection while the package is executing.
Public fieldStatic memberDTS_E_CANTALLOCATECOLUMNINFONot enough memory was available to allocate a list of the columns that are being manipulated by this component.
Public fieldStatic memberDTS_E_CANTBUILDBUFFERTYPEThe Data Flow task cannot allocate memory to build a buffer definition. The buffer definition had %1!d! columns.
Public fieldStatic memberDTS_E_CANTBUILDTHREADPOOLThe Sort transformation could not create a thread pool with %1!d! threads. Not enough memory is available.
Public fieldStatic memberDTS_E_CANTCHANGEPROPERTYTYPEThe property type cannot be changed from the type that was set by the component.
Public fieldStatic memberDTS_E_CANTCHANGEREADONLYATRUNTIMEAn attempt change to a read-only attribute on variable "%1" occurred. This error happens when a read-only attribute for a variable is being changed at runtime. Read-only attributes can be changed only at design time.
Public fieldStatic memberDTS_E_CANTCHANGEUSAGETYPEThe usage type of the column cannot be changed.
Public fieldStatic memberDTS_E_CANTCLONEThe input buffer could not be cloned. An out-of-memory condition occurred or there was an internal error.
Public fieldStatic memberDTS_E_CANTCOMPAREThe data type "%1" cannot be compared. Comparison of that data type is not supported, so it cannot be sorted or used as a key.
Public fieldStatic memberDTS_E_CANTCREATEBLOBFILEThe buffer manager cannot create a file to spool a long object on the directories named in the BLOBTempStoragePath property. Either an incorrect file name was provided, or there are no permissions.
Public fieldStatic memberDTS_E_CANTCREATEBUFFERMANAGERThe Buffer Manager could not be created.
Public fieldStatic memberDTS_E_CANTCREATECERTCONTEXTFailed to create certificate context (error: %1). This occurs in CPackage::put_CertificateObject or CPackage::LoadFromXML when the corresponding CryptoAPI function fails.
Public fieldStatic memberDTS_E_CANTCREATECOMPONENTComponent "%1" could not be created and returned error code 0x%2!8.8X!. Make sure that the component is registered correctly.
Public fieldStatic memberDTS_E_CANTCREATECOMPONENTVIEWCannot create a component view because another one already exists. Only one component view can exist at a time.
Public fieldStatic memberDTS_E_CANTCREATECUSTOMPROPERTYThe custom property "%1" cannot be created.
Public fieldStatic memberDTS_E_CANTCREATEEXECUTIONTREEThere is not enough memory to create an execution tree.
Public fieldStatic memberDTS_E_CANTCREATENEWTYPEThe buffer manager failed to create a new buffer type.
Public fieldStatic memberDTS_E_CANTCREATEPRIMEOUTPUTBUFFERThe Data Flow task failed to create a buffer to call PrimeOutput for output "%3" (%4!d!) on component "%1" (%2!d!). This error usually occurs due to an out-of-memory condition.
Public fieldStatic memberDTS_E_CANTCREATESPOOLFILEThe buffer manager cannot create a temporary storage file on any path in the BufferTempStoragePath property. There is an incorrect file name or no permission.
Public fieldStatic memberDTS_E_CANTCREATEVIEWBUFFERThe Data Flow task engine failed to create a view buffer of type %1!d! over type %2!d! for buffer %3!d.
Public fieldStatic memberDTS_E_CANTCREATEVIRTUALBUFFERThe Data Flow task cannot create a virtual buffer to prepare for execution.
Public fieldStatic memberDTS_E_CANTDELETECOLUMNThe column cannot be deleted. The component does not allow columns to be deleted from this input or output.
Public fieldStatic memberDTS_E_CANTDELETEERRORCOLUMNSThe %1 is a special error output column and cannot be deleted.
Public fieldStatic memberDTS_E_CANTDELETEINPUTAn input cannot be deleted from the inputs collection.
Public fieldStatic memberDTS_E_CANTDELETEOUTPUTAn output cannot be removed from the outputs collection.
Public fieldStatic memberDTS_E_CANTDELETEOUTPUTIDCannot delete output ID %1!d! from the output collection. The ID may not be valid, or the ID may have been the default or error output.
Public fieldStatic memberDTS_E_CANTDETERMINEWHICHPROPTOPERSISTUnable to persist object using default persistence. This error occurs when the default persistence is unable to determine which objects are on the hosted object.
Public fieldStatic memberDTS_E_CANTDIRECTROWDirect row to output "%1" (%2!d!) failed.
Public fieldStatic memberDTS_E_CANTFINDCERTBYHASHUnable to find the specified certificate by hash in "MY" store (error: %1). Occurs in CPackage::LoadUserCertificateByHash.
Public fieldStatic memberDTS_E_CANTFINDCERTBYNAMEThe certificate specified by name in MY store cannot be found (error: %1). This occurs in CPackage::LoadUserCertificateByName.
Public fieldStatic memberDTS_E_CANTGETBLOBDATAFailed to retrieve long data for column "%1".
Public fieldStatic memberDTS_E_CANTGETCERTDATAThe raw certificate data cannot be obtained from the supplied certificate object (error: %1). This occurs when CPackage::put_CertificateObject cannot instantiate the ManagedHelper object, when the ManagedHelper object fails, or when the ManagedHelper object returns a malformed array.
Public fieldStatic memberDTS_E_CANTGETCUSTOMPROPERTYCannot retrieve custom property "%1".
Public fieldStatic memberDTS_E_CANTGETCUSTOMPROPERTYCOLLECTIONThe custom property collection cannot be retrieved for initialization.
Public fieldStatic memberDTS_E_CANTGETMUTEXA thread failed to create a mutex at initialization.
Public fieldStatic memberDTS_E_CANTGETSEMAPHOREA thread failed to create a semaphore at initialization.
Public fieldStatic memberDTS_E_CANTGIVEAWAYBUFFERThe Data Flow task engine attempted to copy a buffer to assign another thread, but failed.
Public fieldStatic memberDTS_E_CANTINITINPUTAn input cannot be created to initialize the inputs collection.
Public fieldStatic memberDTS_E_CANTINITOUTPUTAn output cannot be created to initialize the outputs collection.
Public fieldStatic memberDTS_E_CANTINSERTCOLUMNTYPEThe column "%1" can't be inserted because the conversion between types %2 and %3 is not supported.
Public fieldStatic memberDTS_E_CANTINSERTINTOHASHTABLEThere is not enough memory to insert an object into the hash table.
Public fieldStatic memberDTS_E_CANTLOADFROMNODEThe runtime object cannot be loaded from the specified XML node. This happens when trying to load a package or other object from an XML node that is not of the correct type, such as a non-SSIS XML node.
Public fieldStatic memberDTS_E_CANTLOCKBUFFERA buffer could not be locked. The system is out of memory or the buffer manager has reached its quota.
Public fieldStatic memberDTS_E_CANTMODIFYERROROUTPUTCOLUMNDATATYPEThe data type for "%1" cannot be modified in the error "%2".
Public fieldStatic memberDTS_E_CANTMODIFYINVALIDThe component cannot perform the requested metadata change until the validation problem is fixed.
Public fieldStatic memberDTS_E_CANTOPENCERTSTOREOpening MY certificate store failed with error "%1".This occurs in CPackage::LoadUserCertificateByName and CPackage::LoadUserCertificateByHash.
Public fieldStatic memberDTS_E_CANTPROCESSCOLUMNTYPECODEPAGEThe column "%1" cannot be processed because more than one code page (%2!d! and %3!d!) are specified for it.
Public fieldStatic memberDTS_E_CANTREALIZEVIRTUALBUFFERSA set of virtual buffers cannot be realized.
Public fieldStatic memberDTS_E_CANTREGISTERBUFFERTYPEThe Data Flow task cannot register a buffer type. The type had %1!d! columns and was for execution tree %2!d!.
Public fieldStatic memberDTS_E_CANTREGISTERVIEWBUFFERTYPEThe Data Flow task cannot register a view buffer type. The type had %1!d! columns and was for input ID %2!d!.
Public fieldStatic memberDTS_E_CANTSETEXTERNALMETADATACOLUMNDATATYPEPROPERTIESThe %1 does not allow setting external metadata column data type properties.
Public fieldStatic memberDTS_E_CANTSETOUTPUTCOLUMNDATATYPEPROPERTIESThe %1 does not allow setting output column data type properties.
Public fieldStatic memberDTS_E_CANTSETOUTPUTCOLUMNPROPERTYThe property on an output column cannot be set.
Public fieldStatic memberDTS_E_CANTSETUSAGETYPEThe %1 has forbidden the requested use of the input column with lineage ID %2!d!.
Public fieldStatic memberDTS_E_CANTSETUSAGETYPETOREADWRITEThe "%1" is unable to make the column with lineage ID %2!d! read/write because that usage type is not allowed on this column. An attempt was made to change the usage type of an input column to a type, UT_READWRITE, that is not supported on this component.
Public fieldStatic memberDTS_E_CANTWRITETOFILEThe file, "%1", could not be opened for writing. The file could be read-only, or you do not have the correct permissions.
Public fieldStatic memberDTS_E_CERTERRORError processing client certificate. This error can occur when the client certificate provided was not found in the Personal Certificate Store. Verify that the client certificate is valid.
Public fieldStatic memberDTS_E_CHANGESYSTEMVARIABLENAMEFAILEDChanging the name of a variable failed because it is a system variable. System variables are read-only.
Public fieldStatic memberDTS_E_CHANGESYSTEMVARIABLENAMESPACEFAILEDChanging the namespace of a variable failed because it is a system variable. System variables are read-only.
Public fieldStatic memberDTS_E_CHANGESYSTEMVARIABLEREADONLYFAILEDChanging the property of a variable failed because it is a system variable. System variables are read-only.
Public fieldStatic memberDTS_E_CHECKENVELOPEFAILEDFailed to check for XML signature envelope in package XML with error 0x%1!8.8X! "%2". This occurs in CPackage::LoadFromXML.
Public fieldStatic memberDTS_E_CHECKPOINTFILEALREADYEXISTSAn existing checkpoint file is found with contents that do not appear to be for this package, so the file cannot be overwritten to start saving new checkpoints. Remove the existing checkpoint file and try again. This error occurs when a checkpoint file exists, the package is set to not use a checkpoint file, but to save checkpoints. The existing checkpoint file will not be overwritten.
Public fieldStatic memberDTS_E_CHECKPOINTFILELOCKEDThe checkpoint file "%1" is locked by another process. This may occur if another instance of this package is currently executing.
Public fieldStatic memberDTS_E_CHECKPOINTFILENOTSPECIFIEDThe package is configured to always restart from a checkpoint, but checkpoint file is not specified.
Public fieldStatic memberDTS_E_CHECKPOINTLOADXMLThe attempt to load the XML checkpoint file "%1" failed with error 0x%2!8.8X! "%3". Check that the file name specified is correct, and that the file exists.
Public fieldStatic memberDTS_E_CHECKPOINTMISMATCHCheckpoint file "%1" does not match this package. The ID of the package and the ID in the checkpoint file do not match.
Public fieldStatic memberDTS_E_CLIENTAUTHClient certificate is missing. This error occurs when the server is expecting an SSL client certificate and the user has provided an invalid certificate, or has not provided a certificate. A client certificate must be configured for this connection.
Public fieldStatic memberDTS_E_CMDDESTNOPARAMSUnable to retrieve destination column descriptions from the parameters of the SQL command.
Public fieldStatic memberDTS_E_CMDDESTNOTBOUNDParameters are not bound. All parameters in the SQL command must be bound to input columns.
Public fieldStatic memberDTS_E_CODE_PAGE_NOT_SUPPORTEDThe code page %1!d! specified on column "%2" (%3!d!) is not supported. You must first convert this column to DT_WSTR which can be done by inserting a Data Conversion Transform before this one.
Public fieldStatic memberDTS_E_CODEPAGEREQUIREDThe "%1" requires a code page to be set but the value passed was zero.
Public fieldStatic memberDTS_E_COLLECTIONCOULDNTADDAn object was created but the attempt to add it to a collection failed. This can occur due to an out-of-memory condition.
Public fieldStatic memberDTS_E_COLLECTIONLOCKEDThis collection cannot be modified during package validation or execution.
Public fieldStatic memberDTS_E_COLLOCKEDThe "%1" collection cannot be modified during package validation or execution. "%2" cannot be added to the collection.
Public fieldStatic memberDTS_E_COLLOCKED_NO_CREATIONNAMEThe collection cannot be modified if the created item has no name.
Public fieldStatic memberDTS_E_COLNOTMAPPEDTOCACHECOLThe __ is not mapped to valid cache column.
Public fieldStatic memberDTS_E_COLUMNDATAOVERFLOWDISKIOBUFFERThe column data for column "%1" overflowed the disk I/O buffer.
Public fieldStatic memberDTS_E_COLUMNDELIMITERNOTFOUNDThe column delimiter for column "%1" was not found.
Public fieldStatic memberDTS_E_COLUMNMAPPEDTOALREADYMAPPEDEXTERNALMETADATACOLUMNThe %1 is mapped to the external metadata column with ID %2!ld!, which is already mapped to another column.
Public fieldStatic memberDTS_E_COLUMNMAPPEDTONONEXISTENTEXTERNALMETADATACOLUMNThe %1 is mapped to an external metadata column that does not exist.
Public fieldStatic memberDTS_E_COLUMNMETADATAUNAVAILABLEFORVALIDATIONThe column metadata was unavailable for validation.
Public fieldStatic memberDTS_E_COLUMNNOTFOUNDColumn "%1" cannot be found at the data source.
Public fieldStatic memberDTS_E_COLUMNNOTMAPPEDTOEXTERNALMETADATACOLUMNThe external metadata column mapping for %1 is not valid. The external metadata column ID cannot be zero.
Public fieldStatic memberDTS_E_COLUMNNOTMATCHEDThe column "%1" (%2!d!) cannot be matched to any input file column. The output column name or input column name cannot be found in the file.
Public fieldStatic memberDTS_E_COLUMNPARSEFAILEDFailed to parse the column "%1" in the data file.
Public fieldStatic memberDTS_E_COLUMNSHAVEINCOMPATIBLEMETADATAColumns "%1" and "%2" have incompatible metadata.
Public fieldStatic memberDTS_E_COLUMNSTATUSERRORThere was an error with %1 on %2. The column status returned was: "%3".
Public fieldStatic memberDTS_E_COMERRORCOM error object information is available. Source: "%1" error code: 0x%2!8.8X! Description: "%3".
Public fieldStatic memberDTS_E_COMMANDDESTINATIONADAPTERSTATIC_CANTCONVERTVALUEThe data value cannot be converted for reasons other than sign mismatch or data overflow.
Public fieldStatic memberDTS_E_COMMANDDESTINATIONADAPTERSTATIC_DATAOVERFLOWConversion failed because the data value overflowed the type used by the provider.
Public fieldStatic memberDTS_E_COMMANDDESTINATIONADAPTERSTATIC_ERRORSINCOMMANDThe command execution generated errors.
Public fieldStatic memberDTS_E_COMMANDDESTINATIONADAPTERSTATIC_INTEGRITYVIOLATIONThe data value violated the integrity constraints for the column.
Public fieldStatic memberDTS_E_COMMANDDESTINATIONADAPTERSTATIC_PERMISSIONDENIEDThe user did not have the correct permissions to write to the column.
Public fieldStatic memberDTS_E_COMMANDDESTINATIONADAPTERSTATIC_SCHEMAVIOLATIONThe data value violated the schema constraint.
Public fieldStatic memberDTS_E_COMMANDDESTINATIONADAPTERSTATIC_SIGNMISMATCHConversion failed because the data value was signed and the type used by the provider was unsigned.
Public fieldStatic memberDTS_E_COMMANDDESTINATIONADAPTERSTATIC_TRUNCATEDThe data was truncated.
Public fieldStatic memberDTS_E_COMMANDDESTINATIONADAPTERSTATIC_UNAVAILABLENo status is available.
Public fieldStatic memberDTS_E_COMMITFAILEDA commit failed.
Public fieldStatic memberDTS_E_COMMITTRANSACTIONCommits a transaction.
Public fieldStatic memberDTS_E_COMPFLAGSONLYONSORTCOLThe "%1" cannot have a ComparisonFlags property set to non-zero because its SortKeyPosition is set to zero. An output column's ComparisonFlags can only be non-zero if its SortKeyPosition is also non-zero.
Public fieldStatic memberDTS_E_COMPONENT_NOINTERFACEThe %1 was found, but it does not support a required Integration Services interface (IDTSRuntimeComponent100). Obtain an updated version of this component from the component provider.
Public fieldStatic memberDTS_E_COMPONENTHASINVALIDCLSIDThe CLSID for one of the components with ID %1!d! is not valid.
Public fieldStatic memberDTS_E_COMPONENTINITFAILEDThe component initialization failed.
Public fieldStatic memberDTS_E_COMPONENTNOTFOUNDThe module containing "%1" cannot be located, even though it is registered.
Public fieldStatic memberDTS_E_COMPONENTNOTREGISTEREDThe module containing "%1" is not registered or installed correctly.
Public fieldStatic memberDTS_E_COMPONENTVERSIONMISMATCHThe version of %1 is not compatible with this version of the DataFlow.
Public fieldStatic memberDTS_E_COMPONENTVIEWISUNAVAILABLEThe component view is unavailable. Make sure the component view has been created.
Public fieldStatic memberDTS_E_CONFIGFAILEDConfiguration failure. This is a generic warning for all configuration types. Other warnings should precede this with more information.
Public fieldStatic memberDTS_E_CONFIGFILEFAILEDEXPORTFailure exporting configuration file.
Public fieldStatic memberDTS_E_CONFIGFORMATINVALIDThe configuration entry "%1" had an incorrect format. This can occur because of a missing delimiter or formatting errors, like an invalid array delimiter.
Public fieldStatic memberDTS_E_CONFIGFORMATINVALID_PACKAGEDELIMITERThe configuration entry, "%1", has an incorrect format because it does not begin with package delimiter. There was no "\package" delimiter.
Public fieldStatic memberDTS_E_CONFIGTYPECONVERSIONFAILEDFailed to convert a type in the configuration "%1" for the package path "%2". This happens when a configuration value cannot be converted from a string to the appropriate destination type. Check the configuration value to ensure it can be converted to the type of the destination property or variable.
Public fieldStatic memberDTS_E_CONNECTIONMANAGERCOLUMNCOUNTMISMATCHThe number of columns in the flat file connection manager must be the same as the number of columns in the flat file adapter. The number of columns for the flat file connection manager is %1!d!, while the number of columns for the flat file adapter is %2!d!.
Public fieldStatic memberDTS_E_CONNECTIONMANAGERJOINTRANSACTIONThe connection manager failed to defect from the transaction.
Public fieldStatic memberDTS_E_CONNECTIONMANAGERNOTFOUNDThe connection manager "%1" is not found. A component failed to find the connection manager in the Connections collection.
Public fieldStatic memberDTS_E_CONNECTIONMANAGERQUALIFIERALREADYSETThe qualifier is already set on this instance of the connection manager. The qualifier may be set once per instance.
Public fieldStatic memberDTS_E_CONNECTIONMANAGERQUALIFIERNOTSETThe qualifier has not been set on this instance of the connection manager. Setting the qualifier is required to complete initialization.
Public fieldStatic memberDTS_E_CONNECTIONMANAGERQUALIFIERNOTSUPPORTEDThis connection manager does not support specification of qualifiers.
Public fieldStatic memberDTS_E_CONNECTIONMANAGERTRANSACTEDANDRETAINEDINBULKINSERTThe component cannot use a connection manager that retains its connection in a transaction with fastload or bulk insert.
Public fieldStatic memberDTS_E_CONNECTIONMANANGERNOTASSIGNEDA connection manager has not been assigned to the %1.
Public fieldStatic memberDTS_E_CONNECTIONNOTFOUNDThe connection "%1" is not found. This error is thrown by Connections collection when the specific connection element is not found.
Public fieldStatic memberDTS_E_CONNECTIONOFFLINEThe connection manager "%1" will not acquire a connection because the package OfflineMode property is TRUE. When the OfflineMode is TRUE, connections cannot be acquired.
Public fieldStatic memberDTS_E_CONNECTIONREQUIREDFORMETADATAAn error occurred due to no connection. A connection is required when requesting metadata. If you are working offline, uncheck Work Offline on the SSIS menu to enable the connection.
Public fieldStatic memberDTS_E_CONNECTIONREQUIREDFORREADA connection is required to read data.
Public fieldStatic memberDTS_E_CONNECTIONSTRINGOLE DB has failed making a database connection when using the supplied connection string.
Public fieldStatic memberDTS_E_CONNECTIONSTRINGFORMATThe connection string format is not valid. It must consist of one or more components of the form X=Y, separated by semicolons. This error occurs when a connection string with zero components is set on database connection manager.
Public fieldStatic memberDTS_E_CONNECTIONTERMINATEDThe connection with the server has been reset or terminated. Try again later.
Public fieldStatic memberDTS_E_CONNECTIONVALIDATIONFAILEDConnection "%1" failed validation.
Public fieldStatic memberDTS_E_CONNECTREQUIREDFORMETADATAVALIDATIONError due to no connection. A connection is required before metadata validation can proceed.
Public fieldStatic memberDTS_E_CONNECTTOSERVERFAILEDConnect to SSIS Service on machine "%1" failed: %2.
Public fieldStatic memberDTS_E_CONNECTTOSERVERFAILED_ACCESSDENIEDConnect to server failed. Access denied.
Public fieldStatic memberDTS_E_CONNECTTOSERVERFAILED_NOTREGISTEREDConnect to server failed. The server is not registered.
Public fieldStatic memberDTS_E_CONNECTTOSERVERFAILED_UNAVAILABLEConnect to server failed. Server is unavailable.
Public fieldStatic memberDTS_E_COULD_NOT_DETERMINE_DATASOURCE_DBMSNAMEUnable to determine the DBMS name and version on "%1". This occurs if the IDBProperties on the connection did not return information needed to verify the DBMS name and version.
Public fieldStatic memberDTS_E_COULDNOTCREATECOPYBUFFERThe %1 cannot create a buffer to copy its data into for sorting.
Public fieldStatic memberDTS_E_COULDNOTFINDINPUTBUFFERCOLUMNBYLINEAGEThe %1 cannot find the column with LineageID %2!ld! in its input buffer.
Public fieldStatic memberDTS_E_COULDNOTGETCOLUMNINFOFORCOPYBUFFERThe %1 cannot get the column information for column "%2!lu!" from its copy buffer.
Public fieldStatic memberDTS_E_COULDNOTGETCOLUMNINFOFORINPUTBUFFERThe %1 cannot get the column information for column %2!lu! from its input buffer.
Public fieldStatic memberDTS_E_COULDNOTREGISTERCOPYBUFFERThe %1 cannot register a buffer type for its copy buffer.
Public fieldStatic memberDTS_E_COULDNOTREPLACECHECKPOINTFILECannot replace the existing checkpoint file with the updated checkpoint file. The checkpoint was successfully created in a temporary file, but overwriting the existing file with the new file failed.
Public fieldStatic memberDTS_E_COULDNOTRESOLVEPACKAGEPATHCannot resolve a package path to an object in the package "%1". Verify that the package path is valid.
Public fieldStatic memberDTS_E_CREATECHECKPOINTFILECheckpoint file "%1" failed during creation due to error 0x%2!8.8X! "%3".
Public fieldStatic memberDTS_E_CREATEEXPRESSIONOBJECTFAILEDMemory cannot be allocated for the expression "%1". There was an out-of-memory error while creating an internal object to hold the expression.
Public fieldStatic memberDTS_E_CREATEFOLDERONSQLSERVER_OLEDBThe CreateFolderOnSQLServer method has encountered OLE DB error code 0x%1!8.8X! (%2) The SQL statement issued has failed.
Public fieldStatic memberDTS_E_CREATEMANAGEDHELPERFAILEDThe SSIS managed helper object failed during creation with error 0x%1!8.8X! "%2". This occurs whenever CoCreateInstance CLSID_DTSManagedHelper fails.
Public fieldStatic memberDTS_E_CUSTOMEVENTCONFLICTThe custom event "%1" is already declared with a different parameter list. A task is trying to declare a custom event, which another task has already declared with a different parameter list.
Public fieldStatic memberDTS_E_CUSTOMPROPERTYISREADONLYThe value of custom property "%1" on the %2 cannot be changed.
Public fieldStatic memberDTS_E_CYCLEINEXECUTIONTREEAn execution tree contains a cycle.
Public fieldStatic memberDTS_E_DANGLINGWITHPATH%1 is marked as dangling, but has a path attached to it.
Public fieldStatic memberDTS_E_DATACONVERSIONFAILEDData conversion failed while converting column "%1" (%2!d!) to column "%3" (%4!d!). The conversion returned status value %5!d! and status text "%6".
Public fieldStatic memberDTS_E_DATAREADERDESTCANNOTCONVERTCannot convert the %1 from data type "%2" to data type "%3".
Public fieldStatic memberDTS_E_DATAREADERDESTDATATYPENOTSUPPORTEDThe data type "__" found on __ is not supported for the __.
Public fieldStatic memberDTS_E_DATAREADERDESTINVALIDCODEPAGEThe %1 has unsupported code page %2!d!.
Public fieldStatic memberDTS_E_DATAREADERDESTINVALIDCOLUMNORDINALThe ordinal position of the column is not valid.
Public fieldStatic memberDTS_E_DATAREADERDESTREADERISATENDThe SSIS IDataReader is past the end of the result set.
Public fieldStatic memberDTS_E_DATAREADERDESTREADERISCLOSEDThe SSIS IDataReader is closed.
Public fieldStatic memberDTS_E_DATAREADERDESTREADERTIMEOUTThe SSIS IDataReader is closed. The read timeout has expired.
Public fieldStatic memberDTS_E_DATAREADERDESTREADFAILEDDataReader client has failed to call Read or has closed the DataReader.
Public fieldStatic memberDTS_E_DATAREADERDESTUNABLETOPROCESSDATAThe %1 was unable to process the data.
Public fieldStatic memberDTS_E_DATAREADERSRCUNABLETOPROCESSDATAThe %1 was unable to process the data.
Public fieldStatic memberDTS_E_DATASOURCECOLUMNWITHNONAMEFOUNDThere is a data source column with no name. Each data source column must have a name.
Public fieldStatic memberDTS_E_DATATAP_CREATEFILEFAILUREFailed to create DATATAP file.
Public fieldStatic memberDTS_E_DATATAP_DUPLICATEDuplicates the DATATAP.
Public fieldStatic memberDTS_E_DATATAP_FAILTOAPPLYCONFIGURATIONFailed to apply the configuration on the DATATAP.
Public fieldStatic memberDTS_E_DATATAP_INVALIDFILENAMEInvalid file name.
Public fieldStatic memberDTS_E_DATATAP_INVALIDPATHDATATAP invalid path.
Public fieldStatic memberDTS_E_DATATAP_NOTAPLOCATIONNo DATATAP application.
Public fieldStatic memberDTS_E_DATATAP_READONLYThe DATATAP is read only.
Public fieldStatic memberDTS_E_DATATAPFAILEDDATATAP failed.
Public fieldStatic memberDTS_E_DECRYPTPACKAGE_USERKEYFailed to decrypt a package that is encrypted with a user key. You may not be the user who encrypted this package, or you are not using the same machine that was used to save the package.
Public fieldStatic memberDTS_E_DECRYPTPROJECT_PASSWORDFailed to decrypt a project that is encrypted with a password.
Public fieldStatic memberDTS_E_DECRYPTPROJECT_USERKEYFailed to decrypt a project that is encrypted with a user key.
Public fieldStatic memberDTS_E_DECRYPTXML_PASSWORDFailed to decrypt an encrypted XML node because the password was not specified or not correct. Package load will attempt to continue without the encrypted information.
Public fieldStatic memberDTS_E_DEPRECATEDTASKThe deprecated task.
Public fieldStatic memberDTS_E_DERIVEDRESULT_TOO_LONGThe transform encountered a result value that was longer than %1!u! bytes.
Public fieldStatic memberDTS_E_DESTINATIONFLATFILEREQUIREDNo destination flat file name was provided. Make sure the flat file connection manager is configured with a connection string. If the flat file connection manager is used by multiple components, ensure that the connection string contains enough file names.
Public fieldStatic memberDTS_E_DESTINATIONOBJECTPARENTLESSThe destination object in a property mapping has no parent. The destination object is not a child of any sequence container. It may have been removed from the package.
Public fieldStatic memberDTS_E_DESTINATIONTABLENAMENOTPROVIDEDA destination table name has not been provided.
Public fieldStatic memberDTS_E_DIRECTTONONERROROUTPUTThe buffer manager attempted to push an error row to an output that was not registered as an error output. There was a call to DirectErrorRow on an output that does not have the IsErrorOut property set to TRUE.
Public fieldStatic memberDTS_E_DISCONNECTEDCOMPONENTA component is disconnected from the layout.
Public fieldStatic memberDTS_E_DISCONNECTEDOBJECTThe %1 object "%2" (%3!d!) is disconnected from the layout.
Public fieldStatic memberDTS_E_DISCONNECTEDPATHThe path is disconnected from the path.
Public fieldStatic memberDTS_E_DISKIOBUFFEROVERFLOWThe attempt to write data of %1!d! bytes into the disk I/O failed. The disk I/O buffer has %2!d! free bytes.
Public fieldStatic memberDTS_E_DISKIOFAILEDAn unexpected disk I/O error occurred while reading the file.
Public fieldStatic memberDTS_E_DISKIOTIMEDOUTAn disk I/O time out occurred while reading the file.
Public fieldStatic memberDTS_E_DISPENSEDREADONLYThe Variables collection was returned the from VariableDispenser and cannot be modified. Items cannot be added to or removed from dispensed collections.
Public fieldStatic memberDTS_E_DISTRIBUTORADDFAILEDA distributor failed to give a buffer to thread "%1" because of error 0x%2!8.8X!. The target thread is probably shutting down.
Public fieldStatic memberDTS_E_DISTRIBUTORCANTSETPROPERTYDistributor for thread "%1" failed to initialize property "%2" on component "%3" because of error 0x%8.8X. The distributor could not initialize the component's property and cannot continue running.
Public fieldStatic memberDTS_E_DOESNOTSUPPORTTRANSACTIONSEnlisting in transactions is not supported.
Public fieldStatic memberDTS_E_DTPMISSINGATTRIBUTE
Public fieldStatic memberDTS_E_DTPMISSINGELEMENT
Public fieldStatic memberDTS_E_DTPXMLBOOLCONVERTERRUnable to convert the value "%1" to a Boolean.
Public fieldStatic memberDTS_E_DTPXMLCANTREADIDATTRCannot read ID attribute.
Public fieldStatic memberDTS_E_DTPXMLCONNECTIONLOADERRError setting connection object during XML load.
Public fieldStatic memberDTS_E_DTPXMLDATATYPEERRThe value "%1" is not valid for the attribute "%2".
Public fieldStatic memberDTS_E_DTPXMLDOMCREATEERRORUnable to instantiate XML DOM document, please verify that MSXML binaries are properly installed and registered.
Public fieldStatic memberDTS_E_DTPXMLDOMLOADERRORUnable to load XML data into a local DOM for processing.
Public fieldStatic memberDTS_E_DTPXMLEVENTSCACHEERRCannot acquire Events Interface. An invalid Events interface was passed to the data flow module for persisting to XML.
Public fieldStatic memberDTS_E_DTPXMLIDLOOKUPERRReferenced object with ID %1!d! not found in package.
Public fieldStatic memberDTS_E_DTPXMLINPUTCOLUMNLOADERRError setting input column object during XML load.
Public fieldStatic memberDTS_E_DTPXMLINPUTLOADERRError setting input object during XML load.
Public fieldStatic memberDTS_E_DTPXMLINT32CONVERTERRUnable to convert the value "%1" to an integer.
Public fieldStatic memberDTS_E_DTPXMLINVALIDPROPERTYARRAYNOTENOUGHVALUESToo few array elements were found when parsing a property of type array. The element count is more than the number of array elements found.
Public fieldStatic memberDTS_E_DTPXMLINVALIDPROPERTYARRAYTOOMANYVALUESToo many array elements were found when parsing a property of type array. The element count is less than the number of array elements found.
Public fieldStatic memberDTS_E_DTPXMLINVALIDXMLPERSISTPROPERTYCannot read a persistence property required for the pipeline xml module. The property was not provided by the pipeline.
Public fieldStatic memberDTS_E_DTPXMLLOADFAILUREUnable to load from XML.
Public fieldStatic memberDTS_E_DTPXMLOUTPUTCOLUMNLOADERRError setting output column object during XML load.
Public fieldStatic memberDTS_E_DTPXMLOUTPUTLOADERRError setting output object during XML load.
Public fieldStatic memberDTS_E_DTPXMLPARSEERRORNEARIDLoad error encountered near object with ID %1!d!.
Public fieldStatic memberDTS_E_DTPXMLPATHLOADERRAn error occurred while setting a path object during XML load.
Public fieldStatic memberDTS_E_DTPXMLPROPERTYLOADERRError setting property object during XML load.
Public fieldStatic memberDTS_E_DTPXMLPROPERTYSTATEERRThe value "%1" is not valid for the attribute "%2".
Public fieldStatic memberDTS_E_DTPXMLPROPERTYTYPEERRThe value "%1" is not valid for the attribute "%2".
Public fieldStatic memberDTS_E_DTPXMLSAVEFAILUREUnable to save to XML.
Public fieldStatic memberDTS_E_DTPXMLSETUSAGETYPEERRThe value "%1" is not valid for the attribute "%2".
Public fieldStatic memberDTS_E_DTRXMLSAVEFAILUREUnable to save configuration file. The file may be read only.
Public fieldStatic memberDTS_E_DTS_E_FTPTASK_CANNOT_ACQUIRE_CONNECTIONThere was an error acquiring the FTP connection. Please check if you have specified a valid connection type "%1".
Public fieldStatic memberDTS_E_DTSNAME_ALPHADIGITUNDERBARObject name "%1" is not valid. Name must contain only alphanumeric characters or underscores "_".
Public fieldStatic memberDTS_E_DTSNAME_BEGINSWITHALPHAObject name "%1" is not valid. Name must begin with an alphabetical character.
Public fieldStatic memberDTS_E_DTSNAME_BEGINSWITHALPHAUNDERBARObject name "%1" is not valid. Name must begin with an alphabetical character or underscore "_".
Public fieldStatic memberDTS_E_DTSNAME_LEGALThe object name "%1" is not valid. The name cannot contain any of the following characters: / \ : [ ] . =
Public fieldStatic memberDTS_E_DTSNAME_NOLEADWHITESPObject name "%1" is not valid. Name cannot begin with a whitespace.
Public fieldStatic memberDTS_E_DTSNAME_NOTEMPTYThe object name is not valid. The name cannot be empty.
Public fieldStatic memberDTS_E_DTSNAME_NOTNULLThe object name is not valid. The name cannot be set to NULL.
Public fieldStatic memberDTS_E_DTSNAME_NOTRAILWHITESPObject name "%1" is not valid. Name cannot end with a whitespace.
Public fieldStatic memberDTS_E_DTSNAME_PRINTABLEObject name "%1" is not valid. The name cannot contain control characters that render it unprintable.
Public fieldStatic memberDTS_E_DTSNAME_TOOLONGThe object name is not valid. The name is too long.
Public fieldStatic memberDTS_E_DTSNAME_VALIDFILENAMEObject name "%1" is not valid. The name cannot contain any of the following characters: / \ : ? " < > |
Public fieldStatic memberDTS_E_DTSPROCTASK_CANNOTWRITEINAREADONLYVARIABLEThe Execution result cannot be saved in a read-only variable.
Public fieldStatic memberDTS_E_DTSPROCTASK_CONNECTIONMANAGERNOTOLAPConnection "%1" is not an Analysis Services connection.
Public fieldStatic memberDTS_E_DTSPROCTASK_CONNECTIONNOTFOUNDConnection Manager "%1" it's not defined.
Public fieldStatic memberDTS_E_DTSPROCTASK_DDLEXECUTIONFAILEDExecution of DDL failed.
Public fieldStatic memberDTS_E_DTSPROCTASK_FILECONNECTIONNOTDEFINEDFile connection "%1" is not defined.
Public fieldStatic memberDTS_E_DTSPROCTASK_FILEDOESNOTEXISTThere is no file associated with connection "%1".
Public fieldStatic memberDTS_E_DTSPROCTASK_INVALIDCONNECTIONConnection Manager "%1" it's not a FILE Connection Manager.
Public fieldStatic memberDTS_E_DTSPROCTASK_INVALIDDDLThe DDL is not valid.
Public fieldStatic memberDTS_E_DTSPROCTASK_INVALIDDDLPROCESSINGCOMMANDSThe DDL found in Processing Commands is not valid.
Public fieldStatic memberDTS_E_DTSPROCTASK_INVALIDTASKDATANODEEXEAnalysis Services Execute DDL task received an invalid task data node.
Public fieldStatic memberDTS_E_DTSPROCTASK_INVALIDTASKDATANODEPROCAnalysis Services Processing task received an invalid task data node.
Public fieldStatic memberDTS_E_DTSPROCTASK_INVALIDVARIABLEVariable "%1" it's not defined.
Public fieldStatic memberDTS_E_DTSPROCTASK_NOCONNECTIONSPECIFIEDNo connection manager specified.
Public fieldStatic memberDTS_E_DTSPROCTASK_NONEXISTENTATTRIBUTE"%1" was not found during deserialization.
Public fieldStatic memberDTS_E_DTSPROCTASK_TRACEHASBEENSTOPPEDThe trace has been stopped due to an exception.
Public fieldStatic memberDTS_E_DTSPROCTASK_UNABLETOLOCATECONNECTIONMANAGERUnable to locate connection "%1".
Public fieldStatic memberDTS_E_DTSPROCTASK_VARIABLENOTDEFINEDVariable "%1" is not defined.
Public fieldStatic memberDTS_E_DUMP_FAILEDDebug dump files were not generated correctly. The hresult is __.
Public fieldStatic memberDTS_E_DUPLICATECOLUMNNAMEDuplicate column name "%1".
Public fieldStatic memberDTS_E_DUPLICATECONSTRAINTA precedence constraint already exists between the specified executable. More than one precedence constraint is not allowed.
Public fieldStatic memberDTS_E_DUPLICATEDATASOURCECOLUMNNAMEThere is more than one data source column with the name "%1". The data source column names must be unique.
Public fieldStatic memberDTS_E_DUPLICATEIDFOUNDAttempting to use ID %1!d! more than once in the Data Flow Task.
Public fieldStatic memberDTS_E_DUPLICATELINEAGEIDSINCOLLECTIONTwo objects in the same collection have a duplicate lineage ID of %1!d!. The objects are %2 and %3.
Public fieldStatic memberDTS_E_DUPLICATENAMESINCOLLECTIONThe package contains two objects with the duplicate name of "%1" and "%2".
Public fieldStatic memberDTS_E_DUPLICATEOUTPUTCOLUMNNAMESThe name for "%1" is a duplicate. All names must be unique.
Public fieldStatic memberDTS_E_ELEMENTNOTFOUNDThe element cannot be found in a collection. This error happens when you try to retrieve an element from a collection on a container during execution of the package and the element is not there.
Public fieldStatic memberDTS_E_EMPTYRUNTIMECONNECTIONMANAGERIDThe "%1" in the connection manager collection, Connections, of "%2" does not have a value for the ID property. Verify that the ConnectionManagerID property of the runtime connection object has been set for the component.
Public fieldStatic memberDTS_E_ENUMERATIONELEMENTNOTENUMERABLEAn element of the enumerator returned by the ForEach Enumerator does not implement IEnumerator, contradicting the CollectionEnumerator property of the ForEach Enumerator.
Public fieldStatic memberDTS_E_EOFANNOUNCEMENTFAILEDThe Data Flow task cannot to create a buffer to mark the end of the row set.
Public fieldStatic memberDTS_E_ERRMSGTASK_DIFFERENTMESSAGEANDLANGUAGESIZESThe lists of error messages and their corresponding languages are of different sizes.
Public fieldStatic memberDTS_E_ERRMSGTASK_EMPTYSOURCELISTThere are no Error Messages to transfer.
Public fieldStatic memberDTS_E_ERRMSGTASK_ERRORMESSAGEALREADYEXISTSThe error message "%1" already exists at destination server.
Public fieldStatic memberDTS_E_ERRMSGTASK_ERRORMESSAGECANTBEFOUNDThe error message "%1" cannot be found at source server.
Public fieldStatic memberDTS_E_ERRMSGTASK_ERRORMESSAGEOUTOFRANGEThe error message id "%1" is out of the allowed range of user defined error messages. User defined error message ids are between 50000 and 2147483647.
Public fieldStatic memberDTS_E_ERRMSGTASK_FAILEDTOTRANSFERERRORMESSAGESFailed to transfer some or all of the Error Messages.
Public fieldStatic memberDTS_E_ERRORATLOADTASKError loading task. This happens when loading a task from XML fails.
Public fieldStatic memberDTS_E_ERRORCOLUMNHASINCORRECTPROPERTIESThe %1 on the error output has properties that do not match the properties of its corresponding data source column.
Public fieldStatic memberDTS_E_ERRORCOLUMNHASNOOUTPUTCOLUMNThe %1 on the error output has no corresponding output column on the non-error output.
Public fieldStatic memberDTS_E_ERRORCOMPONENTThe component is missing, not registered, not upgradeable, or missing required interfaces. The contact information for this component is "%1".
Public fieldStatic memberDTS_E_ERRORELEMENTNOTINCOLLElement "%1" does not exist in collection "%2".
Public fieldStatic memberDTS_E_ERRORLOADINGTASKError loading a task. The contact information for the task is "%1". This happens when loading a task fails.
Public fieldStatic memberDTS_E_ERRORLOADINGTASKNOCONTACTError loading task "%1".
Public fieldStatic memberDTS_E_ERROROCCURREDWHILERETRIEVINGFILENAMERetrieving the file name for a component failed with error code 0x%1!8.8X!.
Public fieldStatic memberDTS_E_ERROROCCURREDWITHFOLLOWINGMESSAGEAn error occurred with the following error message: "%1".
Public fieldStatic memberDTS_E_ERROROUTCANTBEONSYNCNONEXCLUSIVEOUTPUT"%1" cannot be an error output because error outputs cannot be placed on synchronous, non-exclusive outputs.
Public fieldStatic memberDTS_E_ERRORPERSISTMANAGEDTASKThe error persist managed task.
Public fieldStatic memberDTS_E_ERRORRETRIEVINGCOLUMNCODEPAGEThere was an error retrieving column code page information.
Public fieldStatic memberDTS_E_ERRORROWDISPMUSTBENOTUSEDThe %1 must have its error row disposition value set to RD_NotUsed.
Public fieldStatic memberDTS_E_ERRORWHILEREADINGDATAROWSAn error occurred while processing file "%1" on data row %2!I64d!.
Public fieldStatic memberDTS_E_ERRORWHILEREADINGHEADERROWSAn error occurred while reading header rows.
Public fieldStatic memberDTS_E_ERRORWHILESKIPPINGDATAROWSAn error occurred while skipping data rows.
Public fieldStatic memberDTS_E_EVENTHANDLERNAMEREADONLYChanging the event handler name failed. Event handler names are read-only.
Public fieldStatic memberDTS_E_EVENTHANDLERNOTALLOWEDThe task providing the custom event "%1" does not allow this event to be handled in the package. The custom event was declared with AllowEventHandlers = FALSE.
Public fieldStatic memberDTS_E_EXCLGRPNOSYNCINP"%1" has a virtual buffer extending from a root source. There is an exclusion group that is not zero with a synchronous input that is zero.
Public fieldStatic memberDTS_E_EXEC2000PKGTASK_CLS_NOT_REGISTRED_EXCEPTIONTo execute the DTS 2000 Package task, start SQL Server Setup and use the Advanced button from the Components to Install page to select Legacy Components.
Public fieldStatic memberDTS_E_EXEC2000PKGTASK_CONVERT_FAILEDCould not convert "%1" to "%2".
Public fieldStatic memberDTS_E_EXEC2000PKGTASK_DATATYPE_NULLThe data type cannot be null. Please specify the correct data type to use for validating the value.
Public fieldStatic memberDTS_E_EXEC2000PKGTASK_DTS2000CANTBEEMPTYThe DTS 2000 package property is empty.
Public fieldStatic memberDTS_E_EXEC2000PKGTASK_ERROR_IN_LOAD_FROM_XMLError occurred in LoadFromXML at the tag "%1".
Public fieldStatic memberDTS_E_EXEC2000PKGTASK_ERROR_IN_PACKAGE_EXECUTEAn error occurred while executing the DTS 2000 package.
Public fieldStatic memberDTS_E_EXEC2000PKGTASK_ERROR_IN_SAVE_TO_XMLError occurred in SaveToXML at the tag "%1".
Public fieldStatic memberDTS_E_EXEC2000PKGTASK_ERROR_IN_VALIDATECould not validate "%1" against "%2".
Public fieldStatic memberDTS_E_EXEC2000PKGTASK_FILE_NAME_NOT_SPECIFIEDStorage file name not specified.
Public fieldStatic memberDTS_E_EXEC2000PKGTASK_HANDLER_NOT_FOUNDHandler not found.
Public fieldStatic memberDTS_E_EXEC2000PKGTASK_INITIALIZATION_WITH_WRONG_XML_ELEMENTExecute DTS 2000 Package task is initiated with a wrong XML element.
Public fieldStatic memberDTS_E_EXEC2000PKGTASK_NOT_PRIMITIVE_TYPE"%1" is not a value type.
Public fieldStatic memberDTS_E_EXEC2000PKGTASK_NULL_VALUECannot validate a null against any data type.
Public fieldStatic memberDTS_E_EXEC2000PKGTASK_NULL_VALUE_ARGUMENTA required argument is null.
Public fieldStatic memberDTS_E_EXEC2000PKGTASK_PACKAGE_ID_NOT_SPECIFIEDPackage ID is not specified.
Public fieldStatic memberDTS_E_EXEC2000PKGTASK_PACKAGE_NAME_NOT_SPECIFIEDPackage name is not specified.
Public fieldStatic memberDTS_E_EXEC2000PKGTASK_PACKAGE_VERSIONGUID_NOT_SPECIFIEDPackage version GUID is not specified.
Public fieldStatic memberDTS_E_EXEC2000PKGTASK_SQL_USERNAME_NOT_SPECIFIEDSQL Server user name not specified.
Public fieldStatic memberDTS_E_EXEC2000PKGTASK_SQLSERVER_NOT_AVAILABLE_NETWORKCannot load the available SQL Servers from the network. Check the network connection.
Public fieldStatic memberDTS_E_EXEC2000PKGTASK_SQLSERVER_NOT_SPECIFIEDSQL Server is not specified.
Public fieldStatic memberDTS_E_EXECPROCTASK_CANTREDIRECTIOCannot redirect streams if the process can continue executing beyond the lifetime of the task.
Public fieldStatic memberDTS_E_EXECPROCTASK_ERROREXECUTIONVALUEThe process exited with return code "%1". However, "%2" was expected.
Public fieldStatic memberDTS_E_EXECPROCTASK_EXECUTABLENOTSPECIFIEDThe executable is not specified.
Public fieldStatic memberDTS_E_EXECPROCTASK_FILEDOESNOTEXISTFile/Process "%1" does not exist in directory "%2".
Public fieldStatic memberDTS_E_EXECPROCTASK_FILENOTINPATHFile/Process "%1" is not in path.
Public fieldStatic memberDTS_E_EXECPROCTASK_INVALIDTIMEOUTThe time-out value provided is not valid. Specify the number of seconds that the task allows the process to run. The minimum time-out is 0, which indicates that no time-out value is used and the process runs to completion or until an error occurs. The maximum time-out is 2147483 (((2^31) - 1)/1000).
Public fieldStatic memberDTS_E_EXECPROCTASK_PROCESSEXITCODEEXCEEDSIn Executing "%2" "%3" at "%1", The process exit code was "%4" while the expected was "%5".
Public fieldStatic memberDTS_E_EXECPROCTASK_PROCESSHASTIMEDOUTThe process timed out.
Public fieldStatic memberDTS_E_EXECPROCTASK_RECEIVEDINVALIDTASKDATANODEThe Execute Process task received a task data node that is not valid.
Public fieldStatic memberDTS_E_EXECPROCTASK_STDERRVARREADONLYThe standard error variable is read-only.
Public fieldStatic memberDTS_E_EXECPROCTASK_STDOUTVARREADONLYThe standard out variable is read-only.
Public fieldStatic memberDTS_E_EXECPROCTASK_WORKINGDIRDOESNOTEXISTThe directory "%1" does not exist.
Public fieldStatic memberDTS_E_EXECPROCTASK_WORKINGDIRECTORYDOESNOTEXISTWorking Directory "%1" does not exist.
Public fieldStatic memberDTS_E_EXECUTIONTREECYCLECannot connect %1 to %2 because a cycle would be created.
Public fieldStatic memberDTS_E_EXECUTIONTREECYCLEADDINGSYNCHRONOUSINPUTThe synchronous input of "%1" cannot be set to "%2" because a cycle would be created.
Public fieldStatic memberDTS_E_EXECUTIONTREECYCLESETTINGIDID %1 cannot be set to %2!d! because a cycle would be created.
Public fieldStatic memberDTS_E_EXISTSONSQLSERVER_OLEDBThe ExistsOnSQLServer method has encountered OLE DB error code 0x%1!8.8X! (%2). The SQL statement issued has failed.
Public fieldStatic memberDTS_E_EXPIREDIntegration Services evaluation period has expired.
Public fieldStatic memberDTS_E_EXPRESSIONCOMPUTEFAILEDComputing the expression "%1" failed with error code 0x%2!8.8X!. The expression may have errors, such as divide by zero, that cannot be detected at parse time, or there may be an out-of-memory error.
Public fieldStatic memberDTS_E_EXPRESSIONNOTBOOLEANThe expression "%1" must evaluate to True or False. Change the expression to evaluate to a Boolean value.
Public fieldStatic memberDTS_E_EXPRESSIONPARSEFAILEDCannot parse the expression "%1". The expression was not valid, or there is an out-of-memory error.
Public fieldStatic memberDTS_E_EXPRESSIONVALIDATIONFAILEDThe expression "%1" on "%2" is not valid.
Public fieldStatic memberDTS_E_EXPREVALAMBIGUOUSINPUTCOLUMNNAMEThere are multiple input columns with the name "%1". The desired input column must be specified uniquely as [Component Name].[%2] or referenced by lineage ID. Currently, the input column specified exists on more than one component.
Public fieldStatic memberDTS_E_EXPREVALAMBIGUOUSVARIABLENNAMEThere are multiple variables with the name "%1". The desired variable must be specified uniquely as @[Namespace::%2]. The variable exists in more than one namespace.
Public fieldStatic memberDTS_E_EXPREVALASSIGNMENTTOREADONLYVARIABLEError using a read-only variable "%1" in an assignment expression. The expression result cannot be assigned to the variable because the variable is read only. Choose a variable that can be written to, or remove the expression from this variable.
Public fieldStatic memberDTS_E_EXPREVALASSIGNMENTTYPEMISMATCHThe result of the assignment expression "%1" cannot be converted to a type that is compatible with the variable that it was assigned to.
Public fieldStatic memberDTS_E_EXPREVALASSIGNMENTVARIABLELOCKFORWRITEFAILEDCannot evaluate expression "%1" because the variable "%2" does not exist or cannot be accessed for writing. The expression result cannot be assigned to the variable because the variable was not found, or could not be locked for write access.
Public fieldStatic memberDTS_E_EXPREVALBINARYOPDTSTRNOTSUPPORTEDFor operands of a binary operation, the data type DT_STR is supported only for input columns and cast operations. The expression "%1" has a DT_STR operand that is not an input column or the result of a cast, and cannot be used in a binary operation. To perform this operation, the operand needs to be explicitly cast with a cast operator.
Public fieldStatic memberDTS_E_EXPREVALBINARYOPERATIONFAILEDThe binary operation "%1" failed with error code 0x%2!8.8X!. An internal error occurred, or an out-of-memory condition exists.
Public fieldStatic memberDTS_E_EXPREVALBINARYOPERATIONSETTYPEFAILEDAttempt to set the result type of binary operation "%1" failed with error code 0x%2!8.8X!.
Public fieldStatic memberDTS_E_EXPREVALBINARYOPERATORCODEPAGEMISMATCHThe code pages for operands of binary operator "%1" for type "%2" must match. Currently, the code page of the left operand does not match the code page of the right operand. For the specified binary operator on the specified type, the code pages must be the same.
Public fieldStatic memberDTS_E_EXPREVALBINARYOPNUMERICOVERFLOWThe result of the binary operation "%1" on data types %2 and %3 exceeds the maximum size for numeric types. The operand types could not be implicitly cast into a numeric (DT_NUMERIC) result without loss of precision or scale. To perform this operation, one or both operands need to be explicitly cast with a cast operator.
Public fieldStatic memberDTS_E_EXPREVALBINARYOPOVERFLOWThe result of the binary operation "%1" exceeds the maximum size for result data type "%2". The magnitude of the result of the operation overflows the type of the result.
Public fieldStatic memberDTS_E_EXPREVALBINARYSIGNMISMATCHThere is a sign mismatch for the bitwise binary operator "%1" in operation "%2". Both operands for this operator must be positive or negative.
Public fieldStatic memberDTS_E_EXPREVALBINARYTYPEMISMATCHThe data types "%1" and "%2" are incompatible for binary operator "%3". The operand types could not be implicitly cast into compatible types for the operation. To perform this operation, one or both operands need to be explicitly cast with a cast operator.
Public fieldStatic memberDTS_E_EXPREVALBUILDSTRINGFAILEDAttempt to generate a string representation of the expression failed with error code 0x%1!8.8X!. Failed when attempting to generate a displayable string that represents the expression.
Public fieldStatic memberDTS_E_EXPREVALCANNOTCONVERTRESULTCannot convert the expression result data type "%1" to the column data type "%2". The result of the expression should be written to an input/output column, but the data type of the expression cannot be converted to the data type of the column.
Public fieldStatic memberDTS_E_EXPREVALCASTCODEPAGEMISMATCHUnable to cast expression "%1" from data type "%2" to data type "%3" because the code page of the value being cast (%4!d!) does not match the requested result code page (%5!d!). The code page of the source must match the code page requested for the destination.
Public fieldStatic memberDTS_E_EXPREVALCASTFAILEDCasting expression "%1" from data type "%2" to data type "%3" failed with error code 0x%4!8.8X!.
Public fieldStatic memberDTS_E_EXPREVALCHARMAPPINGFAILEDThe function "%1" cannot perform the character mapping on string "%2".
Public fieldStatic memberDTS_E_EXPREVALCOMPUTEFAILEDAttempt to compute the expression "%1" failed with error code 0x%2!8.8X!.
Public fieldStatic memberDTS_E_EXPREVALCONDITIONALOPCODEPAGEMISMATCHThe code pages must match for operands of conditional operation "%1" for type %2. The code page of the left operand does not match the code page of the right operand. For the conditional operator on the specified type, the code pages must be the same.
Public fieldStatic memberDTS_E_EXPREVALCONDITIONALOPDTSTRNOTSUPPORTEDFor operands of the conditional operator, the data type DT_STR is supported only for input columns and cast operations. The expression "%1" has a DT_STR operand that is not an input column or the result of a cast, and cannot be used with the conditional operation. To perform this operation, the operand needs to be explicitly cast with a cast operator.
Public fieldStatic memberDTS_E_EXPREVALCONDITIONALOPERATIONFAILEDThe conditional operation "%1" failed with error code 0x%2!8.8X!. There was an internal error or an out-of-memory error.
Public fieldStatic memberDTS_E_EXPREVALCONDITIONALOPINVALIDCONDITIONTYPEThe conditional expression "%1" of the conditional operator has an invalid data type of "%2". The conditional expression of the conditional operator must return a Boolean, which is type DT_BOOL.
Public fieldStatic memberDTS_E_EXPREVALCONDITIONALOPSETTYPEFAILEDAttempt to set the result type of conditional operation "%1" failed with error code 0x%2!8.8X!.
Public fieldStatic memberDTS_E_EXPREVALCONDITIONALOPTYPEMISMATCHThe data types "%1" and "%2" are incompatible for the conditional operator. The operand types cannot be implicitly cast into compatible types for the conditional operation. To perform this operation, one or both operands need to be explicitly cast with a cast operator.
Public fieldStatic memberDTS_E_EXPREVALDATACONVERSIONFAILEDError code 0x%1!8.8X! occurred attempting to convert from data type %2 to data type %3.
Public fieldStatic memberDTS_E_EXPREVALDATACONVERSIONNOTSUPPORTEDConversion from data type "%1" to data type "%2" is unsupported. The source type cannot be converted to the destination type.
Public fieldStatic memberDTS_E_EXPREVALDATACONVERSIONOVERFLOWAn overflow occurred while converting from data type "%1" to data type "%2". The source type is too large for the destination type.
Public fieldStatic memberDTS_E_EXPREVALDIVBYZEROA divide-by-zero error occurred. The right side operand evaluates to zero in the expression "%1".
Public fieldStatic memberDTS_E_EXPREVALDOTTEDINPUTCOLUMNNAMENOTFOUNDLocating the input column named "[%1].[%2]" failed with error code 0x%3!8.8X!. The input column was not found in the input column collection.
Public fieldStatic memberDTS_E_EXPREVALEXPRESSIONEMPTYThere was no expression to compute. An attempt was made to compute or get the string of an empty expression.
Public fieldStatic memberDTS_E_EXPREVALFAILEDTOCONVERTSTRCOLUMNTOWSTRConverting "%1" from type DT_STR to type DT_WSTR failed with error code 0x%2!8.8X!. An error occurred while performing the implicit conversion on the input column.
Public fieldStatic memberDTS_E_EXPREVALFAILEDTOPARSEEXPRESSIONThe expression "%1" is not valid and cannot be parsed. The expression may contain invalid elements or it may not be well-formed.
Public fieldStatic memberDTS_E_EXPREVALFAILEDTOPARSEEXPRESSIONOUTOFMEMORYAttempt to parse the expression "%1" failed because there was an out-of-memory error.
Public fieldStatic memberDTS_E_EXPREVALFAILEDTOPARSEEXPRESSIONWITHHRAttempt to parse the expression "%1" failed and returned error code 0x%2!8.8X!. The expression cannot be parsed. It might contain invalid elements or it might not be well-formed. There may also be an out-of-memory error.
Public fieldStatic memberDTS_E_EXPREVALFNFINDSTRINGINVALIDOCCURRENCECOUNTThe occurrence count %1!d! is not valid for function "%2". This parameter must be greater than zero.
Public fieldStatic memberDTS_E_EXPREVALFNLEFTRIGHTINVALIDLENGTHThe length of the expression from left to right is invalid.
Public fieldStatic memberDTS_E_EXPREVALFNREPLICATEINVALIDREPEATCOUNTThe repeat count %1!d! is negative and is not valid for function "%2". The repeat count parameter cannot be negative.
Public fieldStatic memberDTS_E_EXPREVALFNSUBSTRINGINVALIDLENGTHThe length %1!d! is not valid for function "%2". The length parameter cannot be negative. Change the length parameter to zero or a positive value.
Public fieldStatic memberDTS_E_EXPREVALFNSUBSTRINGINVALIDSTARTINDEXThe start index %1!d! is not valid for function "%2". The start index value must be an integer greater than 0. Start index is one-based, not zero-based.
Public fieldStatic memberDTS_E_EXPREVALFNTOKEN_EMPTYDELIMThe expression value from token.
Public fieldStatic memberDTS_E_EXPREVALFUNCTIONCOMPUTEFAILEDEvaluating function "%1" failed with error code 0x%2!8.8X!.
Public fieldStatic memberDTS_E_EXPREVALFUNCTIONCONVERTPARAMTOMEMBERFAILEDParameter number %1!d! of the function "%2" cannot be converted to a static value.
Public fieldStatic memberDTS_E_EXPREVALFUNCTIONOVERFLOWThe result of the function call "%1" is too large to fit in type "%2". The magnitude of the result of the function call overflows the type of the operand. An explicit cast to a larger type may be required.
Public fieldStatic memberDTS_E_EXPREVALFUNCTIONPARAMNOTSTATICParameter number %1!d! of the function "%2" is not static. This parameter must be static, and cannot contain dynamic elements such as input columns.
Public fieldStatic memberDTS_E_EXPREVALILLEGALESCAPEINSTRINGLITERALThe string literal "%1" contains an illegal escape sequence of "\%2!c!". The escape sequence is not supported in string literals in the expression evaluator. If a backslash is needed in the string, use a double backslash, "\\".
Public fieldStatic memberDTS_E_EXPREVALILLEGALHEXESCAPEINSTRINGLITERALThe string literal "%1" contains an illegal hexadecimal escape sequence of "\x%2". The escape sequence is not supported in string literals in the expression evaluator. The hexadecimal escape sequences must be of the form \xhhhh where h is a valid hexadecimal digit.
Public fieldStatic memberDTS_E_EXPREVALINPUTCOLUMNIDNOTFOUNDAttempt to find the input column with lineage ID %1!d! failed with error code 0x%2!8.8X!. The input column was not found in the input column collection.
Public fieldStatic memberDTS_E_EXPREVALINPUTCOLUMNNAMENOTFOUNDAttempt to find the input column named "%1" failed with error code 0x%2!8.8X!. The input column specified was not found in the input column collection.
Public fieldStatic memberDTS_E_EXPREVALINVALIDCASTCannot cast expression "%1" from data type "%2" to data type "%3". The requested cast is not supported.
Public fieldStatic memberDTS_E_EXPREVALINVALIDCASTCODEPAGEThe value, %1!d!, specified for the code page parameter of the cast to data type "%2", is not valid. The code page is not installed on the machine.
Public fieldStatic memberDTS_E_EXPREVALINVALIDCASTLENGTHThe value %1!d! specified for the length parameter of the cast to data type %2 is negative and not valid. The length must be positive.
Public fieldStatic memberDTS_E_EXPREVALINVALIDCASTPARAMParameter number %1!d! of the cast to data type "%2" is not valid. The parameters of cast operators must be static, and cannot contain dynamic elements such as input columns.
Public fieldStatic memberDTS_E_EXPREVALINVALIDCASTPARAMTYPEParameter number %1!d! of the cast to data type "%2" is not an integer. A parameter of a cast operator must be an integer or a type that can be converted to an integer.
Public fieldStatic memberDTS_E_EXPREVALINVALIDCASTPRECISIONThe value %1!d! specified for the precision parameter of the cast to data type "%2" is not valid. Precision must be in the range %3!d! to %4!d! and the precision value is out of range for the type cast.
Public fieldStatic memberDTS_E_EXPREVALINVALIDCASTSCALEThe value %1!d! specified for the scale parameter of the cast to data type "%2" is not valid. The scale must be in the range %3!d! to %4!d! and the scale value is out of range for the type cast. Scale must not exceed precision and must be positive.
Public fieldStatic memberDTS_E_EXPREVALINVALIDDATEPART"%1" is not a valid date part for function "%2".
Public fieldStatic memberDTS_E_EXPREVALINVALIDDATEPARTNODEThe date part parameter specified for function "%1" is not valid. It must be a static string. The date part parameter cannot contain dynamic elements, such as input columns, and must be of type DT_WSTR.
Public fieldStatic memberDTS_E_EXPREVALINVALIDFUNCTIONThe function "%1" was not recognized. Either the function name is incorrect or does not exist.
Public fieldStatic memberDTS_E_EXPREVALINVALIDNULLCODEPAGEThe value %1!d! specified for the code page parameter of the NULL function with data type "%2" is not valid. The code page is not installed on the computer.
Public fieldStatic memberDTS_E_EXPREVALINVALIDNULLLENGTHThe value %1!d! specified for the length parameter of the "NULL" function with data type %2 is negative and not valid. The length must be positive.
Public fieldStatic memberDTS_E_EXPREVALINVALIDNULLPARAMParameter number %1!d! of the function NULL with data type "%2" is not valid. The parameters of NULL() must be static, and cannot contain dynamic elements such as input columns.
Public fieldStatic memberDTS_E_EXPREVALINVALIDNULLPARAMTYPEParameter number %1!d! of the function NULL with data type "%2" is not an integer. A parameter of NULL() must be an integer or a type that can be converted to an integer.
Public fieldStatic memberDTS_E_EXPREVALINVALIDNULLPRECISIONThe value %1!d! specified for the precision parameter of the NULL function with data type "%2" is out of range. Precision must be in the range %3!d! to %4!d!.
Public fieldStatic memberDTS_E_EXPREVALINVALIDNULLSCALEThe value %1!d! specified for the scale parameter of the NULL function with data type %2 is out of range. Scale must be in the range %3!d! to %4!d!. Scale must not exceed precision and must not be negative.
Public fieldStatic memberDTS_E_EXPREVALINVALIDNUMBEROFPARAMSPLURALPLURALThe function "%1" requires %2!d! parameters, not %3!d! parameters. The function name was recognized, but the number of parameters is not valid.
Public fieldStatic memberDTS_E_EXPREVALINVALIDNUMBEROFPARAMSPLURALSINGULARThe function "%1" requires %2!d! parameters, not %3!d! parameter. The function name was recognized, but the number of parameters is not valid.
Public fieldStatic memberDTS_E_EXPREVALINVALIDNUMBEROFPARAMSSINGULARPLURALThe function "%1" requires %2!d! parameter, not %3!d! parameters. The function name was recognized, but the number of parameters is not valid.
Public fieldStatic memberDTS_E_EXPREVALINVALIDTOKENAttempt to parse the expression "%1" failed. The token "%2" at line number "%3", character number "%4" was not recognized. The expression cannot be parsed because it contains invalid elements at the location specified.
Public fieldStatic memberDTS_E_EXPREVALINVALIDTOKENSINGLEEQUALParsing the expression "%1" failed. The equal sign (=) at line number "%2", character number "%3", was not expected. A double equals sign (==) may be required at the location specified.
Public fieldStatic memberDTS_E_EXPREVALINVALIDTOKENSINGLEQUOTEParsing the expression "%1" failed. The single quotation mark at line number "%2", character number "%3", was not expected.
Public fieldStatic memberDTS_E_EXPREVALINVALIDTOKENSTATEAttempt to parse the expression "%1" failed. The expression might contain an invalid token, an incomplete token, or an invalid element. It might not be well-formed, or might be missing part of a required element such as a parenthesis.
Public fieldStatic memberDTS_E_EXPREVALLITERALOVERFLOWThe literal "%1" is too large to fit into type %2. The magnitude of the literal overflows the type.
Public fieldStatic memberDTS_E_EXPREVALLNINVALIDPARAMThe function LN cannot operate on zero or negative values, and a zero or negative value was passed to the LN function.
Public fieldStatic memberDTS_E_EXPREVALLOGINVALIDPARAMThe function LOG cannot operate on zero or negative values, and a zero or negative value was passed to the LOG function.
Public fieldStatic memberDTS_E_EXPREVALNOINPUTCOLUMNCOLLECTIONFORCOLUMNIDThe expression contains unrecognized token "#%1!d!".
Public fieldStatic memberDTS_E_EXPREVALNOINPUTCOLUMNCOLLECTIONFORCOLUMNNAMEThe expression contains unrecognized token "%1". If "%1" is a variable, it should be expressed as "@%1". The specified token is not valid. If the token is intended to be a variable name, it should be prefixed with the @ symbol.
Public fieldStatic memberDTS_E_EXPREVALPARAMTYPEMISMATCHThe function "%1" does not support the data type "%2" for parameter number %3!d!. The type of the parameter could not be implicitly cast into a compatible type for the function. To perform this operation, the operand needs to be explicitly cast with a cast operator.
Public fieldStatic memberDTS_E_EXPREVALPLACEHOLDERINEXPRESSIONThe placeholder "%1" was found in an expression. This must be replaced with an actual parameter or operand.
Public fieldStatic memberDTS_E_EXPREVALPOWERINVALIDPARAMThe parameters passed to the function POWER cannot be evaluated and yield an indeterminate result.
Public fieldStatic memberDTS_E_EXPREVALRESULTTYPECONVERSIONFAILEDThe conversion of the result of the expression"%1" from type "%2" to a supported type failed with error code 0x%3!8.8X!. An unexpected error occurred when trying to convert the expression result to a type supported by the runtime engine, even though the type conversion is supported.
Public fieldStatic memberDTS_E_EXPREVALRESULTTYPENOTSUPPORTEDThe expression "%1" has a result type of "%2", which cannot be converted to a supported type.
Public fieldStatic memberDTS_E_EXPREVALSENSITIVEERRORA sensitive error occurred during the evaluation of the expression.
Public fieldStatic memberDTS_E_EXPREVALSQRTINVALIDPARAMThe function SQRT cannot operate on negative values, and a negative value was passed to the SQRT function.
Public fieldStatic memberDTS_E_EXPREVALSTATIC_AMBIGUOUSINPUTCOLUMNNAMEAn ambiguous input column name was specified. The column must be qualified as [Component Name].[Column Name] or referenced by lineage ID. This error occurs when the input column exists on more than one component, and must be differentiated by the addition of component name or by using the lineage ID.
Public fieldStatic memberDTS_E_EXPREVALSTATIC_AMBIGUOUSVARIABLENNAMEAn ambiguous variable name was specified. The desired variable must be qualified as @[Namespace::Variable]. This error occurs when the variable exists in more than one namespace.
Public fieldStatic memberDTS_E_EXPREVALSTATIC_BINARYOPDTSTRNOTSUPPORTEDFor operands of binary operation, the data type DT_STR is only supported for input columns and cast operations. A DT_STR operand that is not an input column or the result of a cast cannot be used with a binary operation. To perform this operation, the operand needs to be explicitly cast with a cast operator.
Public fieldStatic memberDTS_E_EXPREVALSTATIC_BINARYOPERATIONFAILEDA binary operation failed. There was an out-of-memory condition, or an internal error occurred.
Public fieldStatic memberDTS_E_EXPREVALSTATIC_BINARYOPERATIONSETTYPEFAILEDSetting the result type of a binary operation failed.
Public fieldStatic memberDTS_E_EXPREVALSTATIC_BINARYOPERATORCODEPAGEMISMATCHThe code pages do not match in a binary operation. The code page of the left operand does not match the code page of the right operand. For this binary operation, the code pages must be the same.
Public fieldStatic memberDTS_E_EXPREVALSTATIC_BINARYOPNUMERICOVERFLOWThe result of a binary operation was too big for the maximum size for numeric types. The operand types could not be implicitly cast into a numeric (DT_NUMERIC) result without loss of precision or scale. To perform this operation, one or both operands need to be explicitly cast with a cast operator.
Public fieldStatic memberDTS_E_EXPREVALSTATIC_BINARYOPOVERFLOWThe magnitude of the result of a binary operation overflows the maximum size for result data type.
Public fieldStatic memberDTS_E_EXPREVALSTATIC_BINARYSIGNMISMATCHThere is a sign mismatch for the bitwise binary operator. The operands for this operator must be both positive or both negative.
Public fieldStatic memberDTS_E_EXPREVALSTATIC_BINARYTYPEMISMATCHIncompatible data types were used with a binary operator. The operand types could not be implicitly cast into compatible types for the operation. To perform this operation, one or both operands need to be explicitly cast with a cast operator.
Public fieldStatic memberDTS_E_EXPREVALSTATIC_BUILDSTRINGFAILEDAttempt to generate a string representation of the expression failed.
Public fieldStatic memberDTS_E_EXPREVALSTATIC_CANNOTCONVERTRESULTCannot convert the expression result data type to the column data type. The result of the expression should be written to an input/output column, but the data type of the expression cannot be converted to the data type of the column.
Public fieldStatic memberDTS_E_EXPREVALSTATIC_CASTCODEPAGEMISMATCHUnable to cast the expression because the code page of the value being cast does not match the requested result code page. The code page of the source must match the code page requested for the destination.
Public fieldStatic memberDTS_E_EXPREVALSTATIC_CASTFAILEDAn error occurred while attempting to perform a type cast.
Public fieldStatic memberDTS_E_EXPREVALSTATIC_CHARMAPPINGFAILEDA character mapping function failed.
Public fieldStatic memberDTS_E_EXPREVALSTATIC_COMPUTATIONFAILEDAn error occurred during computation of the expression.
Public fieldStatic memberDTS_E_EXPREVALSTATIC_COMPUTEFAILEDAttempt to compute the expression failed.
Public fieldStatic memberDTS_E_EXPREVALSTATIC_CONDITIONALOPCODEPAGEMISMATCHThe code pages do not match in a conditional operation. The code page of the left operand does not match the code page of the right operand. For the conditional operator of that type, the code pages must be the same.
Public fieldStatic memberDTS_E_EXPREVALSTATIC_CONDITIONALOPDTSTRNOTSUPPORTEDFor operands of the conditional operator, the data type DT_STR is only supported for input columns and cast operations. A DT_STR operand that is not an input column or the result of a cast cannot be used with the conditional operation. To perform this operation, the operand needs to be explicitly cast with a cast operator.
Public fieldStatic memberDTS_E_EXPREVALSTATIC_CONDITIONALOPERATIONFAILEDThe conditional operation failed.
Public fieldStatic memberDTS_E_EXPREVALSTATIC_CONDITIONALOPINVALIDCONDITIONTYPEThe conditional expression of the conditional operator has invalid data type. The conditional expression must be of type DT_BOOL.
Public fieldStatic memberDTS_E_EXPREVALSTATIC_CONDITIONALOPSETTYPEFAILEDSetting the result type of a conditional operation failed.
Public fieldStatic memberDTS_E_EXPREVALSTATIC_CONDITIONALOPTYPEMISMATCHThe data types of the operands of the conditional operator were incompatible. The operand types could not be implicitly cast into compatible types for the conditional operation. To perform this operation, one or both operands need to be explicitly cast with a cast operator.
Public fieldStatic memberDTS_E_EXPREVALSTATIC_DATACONVERSIONFAILEDAn error occurred while attempting to perform data conversion. The source type could not be converted to the destination type.
Public fieldStatic memberDTS_E_EXPREVALSTATIC_DATACONVERSIONNOTSUPPORTEDThe expression contains an unsupported data type conversion. The source type cannot be converted to the destination type.
Public fieldStatic memberDTS_E_EXPREVALSTATIC_DATACONVERSIONOVERFLOWAn overflow occurred while converting between data types. The source type is too large to fit in the destination type.
Public fieldStatic memberDTS_E_EXPREVALSTATIC_DIVBYZERODivision by zero occurred in the expression.
Public fieldStatic memberDTS_E_EXPREVALSTATIC_FAILEDTOCONVERTSTRCOLUMNTOWSTRConverting an input column from type DT_STR to type DT_WSTR failed. An error occurred while performing the implicit conversion on the input column.
Public fieldStatic memberDTS_E_EXPREVALSTATIC_FAILEDTOPARSEEXPRESSIONThe expression is not valid and could not be parsed. It might contain invalid elements, or it might not be well-formed.
Public fieldStatic memberDTS_E_EXPREVALSTATIC_FNFINDSTRINGINVALIDOCCURRENCECOUNTThe occurrence count parameter is not valid for function FINDSTRING. This parameter must be greater than zero.
Public fieldStatic memberDTS_E_EXPREVALSTATIC_FNREPLICATEINVALIDREPEATCOUNTThe repeat count parameter is not valid for function REPLICATE. This parameter cannot be negative.
Public fieldStatic memberDTS_E_EXPREVALSTATIC_FNRIGHTINVALIDLENGTHThe length parameter is not valid for function RIGHT. The length parameter cannot be negative.
Public fieldStatic memberDTS_E_EXPREVALSTATIC_FNSUBSTRINGINVALIDLENGTHThe length parameter was not valid for function SUBSTRING. The length parameter cannot be negative.
Public fieldStatic memberDTS_E_EXPREVALSTATIC_FNSUBSTRINGINVALIDSTARTINDEXThe start index was not valid for function SUBSTRING. The start index value must be an integer greater than zero. The start index is 1-based, not 0-based.
Public fieldStatic memberDTS_E_EXPREVALSTATIC_FUNCTIONCOMPUTEFAILEDAn error occurred while evaluating the function.
Public fieldStatic memberDTS_E_EXPREVALSTATIC_FUNCTIONCONVERTPARAMTOMEMBERFAILEDA function parameter cannot be converted to a static value. The parameter must be static and cannot contain dynamic elements such as input columns.
Public fieldStatic memberDTS_E_EXPREVALSTATIC_FUNCTIONOVERFLOWThe magnitude of the result of a function call was too big to fit in the result type, and overflowed the type of the operand. An explicit cast to a larger type may be required.
Public fieldStatic memberDTS_E_EXPREVALSTATIC_FUNCTIONPARAMNOTSTATICAn invalid parameter was given for a function. This parameter must be static and cannot contain dynamic elements such as input columns.
Public fieldStatic memberDTS_E_EXPREVALSTATIC_ILLEGALESCAPEINSTRINGLITERALThe string literal contains an illegal escape sequence. The escape sequence is not supported in string literals in the expression evaluator. If a backslash is needed in the string, format it as a double backslash, "\\".
Public fieldStatic memberDTS_E_EXPREVALSTATIC_ILLEGALHEXESCAPEINSTRINGLITERALA string literal contains an illegal hexadecimal escape sequence. The escape sequence is not supported in string literals in the expression evaluator. Hexadecimal escape sequences must be of the form \xhhhh where h is a valid hexadecimal digit.
Public fieldStatic memberDTS_E_EXPREVALSTATIC_INPUTCOLUMNIDNOTFOUNDAttempt to find an input column by lineage ID failed. The input column was not found in the input column collection.
Public fieldStatic memberDTS_E_EXPREVALSTATIC_INPUTCOLUMNNAMENOTFOUNDThe input column specified was not found in the input column collection.
Public fieldStatic memberDTS_E_EXPREVALSTATIC_INVALIDCASTThe expression contained an unsupported type cast.
Public fieldStatic memberDTS_E_EXPREVALSTATIC_INVALIDCASTCODEPAGEThe value specified for the code page parameter of the cast to data type DT_STR or DT_TEXT is not valid. The specified code page is not installed on the computer.
Public fieldStatic memberDTS_E_EXPREVALSTATIC_INVALIDCASTLENGTHThe value specified for the length parameter of a cast operation is not valid. The length must be positive. The length specified for the type cast is negative. Change to a positive value.
Public fieldStatic memberDTS_E_EXPREVALSTATIC_INVALIDCASTPARAMAn invalid parameter was given for a cast operation. Parameters of cast operators must be static, and cannot contain dynamic elements such as input columns.
Public fieldStatic memberDTS_E_EXPREVALSTATIC_INVALIDCASTPARAMTYPEAn invalid parameter was given for a cast operation. A parameter of a cast operator must be an integer, or a type that can be converted to an integer.
Public fieldStatic memberDTS_E_EXPREVALSTATIC_INVALIDCASTPRECISIONThe value specified for the precision parameter of a cast operation is out of range for the type cast.
Public fieldStatic memberDTS_E_EXPREVALSTATIC_INVALIDCASTSCALEThe value specified for the scale parameter of a cast operation is out of range for the type cast. Scale must not exceed precision and must not be negative.
Public fieldStatic memberDTS_E_EXPREVALSTATIC_INVALIDDATEPARTAn unrecognized date part parameter was specified for a date function.
Public fieldStatic memberDTS_E_EXPREVALSTATIC_INVALIDDATEPARTNODEThe "date part" parameter specified for a date function is not valid. "Date part" parameters must be static strings, and cannot contain dynamic elements such as input columns. They must be of type DT_WSTR.
Public fieldStatic memberDTS_E_EXPREVALSTATIC_INVALIDFUNCTIONAn invalid function name appeared in the expression. Verify that the function name is correct and does exist.
Public fieldStatic memberDTS_E_EXPREVALSTATIC_INVALIDNULLCODEPAGEThe value specified for the code page parameter of the NULL function with data type DT_STR or DT_TEXT is not valid. The code page specified is not installed on the computer. Either change the code page that is specified, or install the code page on the computer.
Public fieldStatic memberDTS_E_EXPREVALSTATIC_INVALIDNULLLENGTHThe value specified for the length parameter of a NULL function is not valid. The length must be positive. The length specified for the NULL function is negative. Change to a positive value.
Public fieldStatic memberDTS_E_EXPREVALSTATIC_INVALIDNULLPARAMAn invalid parameter was given for function NULL. The parameters of NULL must be static, and cannot contain dynamic elements such as input columns.
Public fieldStatic memberDTS_E_EXPREVALSTATIC_INVALIDNULLPARAMTYPEAn invalid parameter was given for function NULL. A parameter of NULL must be an integer, or a type that can be converted to an integer.
Public fieldStatic memberDTS_E_EXPREVALSTATIC_INVALIDNULLPRECISIONThe value specified for the precision parameter of a NULL function is not valid. The precision that was specified is out of range for the NULL function.
Public fieldStatic memberDTS_E_EXPREVALSTATIC_INVALIDNULLSCALEThe value specified for the scale parameter of a NULL function is not valid. The scale that was specified is out of range for the NULL function. Scale must not exceed precision and must be positive.
Public fieldStatic memberDTS_E_EXPREVALSTATIC_INVALIDNUMBEROFPARAMSAn incorrect number of parameters was given to a function. The function name was recognized, but the number of parameters was not correct.
Public fieldStatic memberDTS_E_EXPREVALSTATIC_INVALIDTOKENThe expression contained a token that was not recognized. The expression could not be parsed because it contains invalid elements.
Public fieldStatic memberDTS_E_EXPREVALSTATIC_INVALIDTOKENSINGLEEQUALThe expression contains an unexpected equal sign (=). This error usually occurs when a double equals sign (==) is needed.
Public fieldStatic memberDTS_E_EXPREVALSTATIC_INVALIDTOKENSINGLEQUOTEThe expression contains an unexpected single quotation mark. A double quotation mark may be required.
Public fieldStatic memberDTS_E_EXPREVALSTATIC_INVALIDTOKENSTATEAttempt to parse the expression failed. The expression contains an invalid or incomplete token. It may contain invalid elements, be missing part of a required element such as closing parentheses, or may not be well formed.
Public fieldStatic memberDTS_E_EXPREVALSTATIC_LITERALOVERFLOWThe magnitude of the literal value was too big to fit in the type requested.
Public fieldStatic memberDTS_E_EXPREVALSTATIC_NOINPUTCOLUMNCOLLECTIONThe expression contains an unrecognized token that appears to be an input column reference, but the input column collection is not available to process input columns. The input column collection has not been provided to the expression evaluator, but an input column was included in the expression.
Public fieldStatic memberDTS_E_EXPREVALSTATIC_PARAMTYPEMISMATCHA function has a parameter with an unsupported data type. The type of the parameter cannot be implicitly cast into a compatible type for the function. To perform this operation, the operand needs to be explicitly cast with a cast operator.
Public fieldStatic memberDTS_E_EXPREVALSTATIC_PLACEHOLDERINEXPRESSIONA placeholder function parameter or operand was found in an expression. This should be replaced with an actual parameter or operand.
Public fieldStatic memberDTS_E_EXPREVALSTATIC_STRINGCOMPARISONFAILEDCannot compare two strings.
Public fieldStatic memberDTS_E_EXPREVALSTATIC_UNARYOPERATIONFAILEDA unary operation failed. An out-of-memory condition occurred, or there was an internal error.
Public fieldStatic memberDTS_E_EXPREVALSTATIC_UNARYOPERATIONSETTYPEFAILEDSetting the result type of a unary operation failed.
Public fieldStatic memberDTS_E_EXPREVALSTATIC_UNARYOPOVERFLOWThe result of a unary minus (negation) operation overflowed the maximum size for result data type. The magnitude of the result of the operation overflows the type of the result.
Public fieldStatic memberDTS_E_EXPREVALSTATIC_UNSUPPORTEDBINARYTYPEAn unsupported data type was used with a binary operator. The type of one, or both, of the operands is not supported for the operation. To perform this operation, one or both operands need to be explicitly cast with a cast operator.
Public fieldStatic memberDTS_E_EXPREVALSTATIC_UNSUPPORTEDTYPEAn unsupported or unrecognized data type was used in the expression.
Public fieldStatic memberDTS_E_EXPREVALSTATIC_UNSUPPORTEDUNNARYTYPEAn unsupported data type is used with a unary operator. The operand type is not supported for the operation. To perform this operation, the operand needs to be explicitly cast with a cast operator.
Public fieldStatic memberDTS_E_EXPREVALSTATIC_VARIABLECOMPUTEFAILEDRetrieving the value for a variable failed.
Public fieldStatic memberDTS_E_EXPREVALSTATIC_VARIABLENOTFOUNDA variable specified was not found in the collection. It might not exist in the correct scope. Verify that the variable exists and that the scope is correct.
Public fieldStatic memberDTS_E_EXPREVALSTATIC_VARIABLETYPENOTSUPPORTEDThe expression contains a variable with an unsupported data type.
Public fieldStatic memberDTS_E_EXPREVALSTRINGCOMPARISONFAILEDComparing "%1" to string "%2" failed.
Public fieldStatic memberDTS_E_EXPREVALSTRINGLITERALTOOLONGA string literal in the expression exceeds the maximum allowed length of %1!d! characters.
Public fieldStatic memberDTS_E_EXPREVALSTRINGVARIABLETOOLONGThe variable %1 contains a string that exceeds the maximum allowed length of %2!d! characters.
Public fieldStatic memberDTS_E_EXPREVALTRUNCATIONASERRORA truncation occurred during evaluation of the expression.
Public fieldStatic memberDTS_E_EXPREVALUNARYOPERATIONFAILEDThe unary operation "%1" failed with error code 0x%2!8.8X!. An internal error occurred, or there is an out-of-memory condition.
Public fieldStatic memberDTS_E_EXPREVALUNARYOPERATIONSETTYPEFAILEDAttempt to set the result type of unary operation "%1" failed with error code 0x%2!8.8X!.
Public fieldStatic memberDTS_E_EXPREVALUNARYOPOVERFLOWThe result of the unary minus (negation) operation "%1" exceeds the maximum size for result data type "%2". The magnitude of the result of the operation overflows the type of the result.
Public fieldStatic memberDTS_E_EXPREVALUNEXPECTEDPARSEERRORAn error occurred when parsing the expression "%1". The expression failed to parse for an unknown reason.
Public fieldStatic memberDTS_E_EXPREVALUNSUPPORTEDBINARYTYPEThe data type "%1" cannot be used with binary operator "%2". The type of one or both of the operands is not supported for the operation. To perform this operation, one or both operands need to be explicitly cast with a cast operator.
Public fieldStatic memberDTS_E_EXPREVALUNSUPPORTEDTYPEThe data type "%1" is not supported in an expression. The specified type is not supported or is not valid.
Public fieldStatic memberDTS_E_EXPREVALUNSUPPORTEDUNNARYTYPEThe data type "%1" cannot be used with unary operator "%2". This operand type is not supported for the operation. To perform this operation, the operand needs to be explicitly cast with a cast operator.
Public fieldStatic memberDTS_E_EXPREVALVARIABLECOMPUTEFAILEDRetrieving the value of Variable "%1" failed with error code 0x%2!8.8X!.
Public fieldStatic memberDTS_E_EXPREVALVARIABLECOULDNOTBEREADReading the variable "%1" failed with error code 0x%2!8.8X!.
Public fieldStatic memberDTS_E_EXPREVALVARIABLENOTFOUNDThe variable "%1" was not found in the Variables collection. The variable might not exist in the correct scope.
Public fieldStatic memberDTS_E_EXPREVALVARIABLETYPENOTSUPPORTEDThe data type of variable "%1" is not supported in an expression.
Public fieldStatic memberDTS_E_EXPRSENSITIVEPARAMVALUENOTALLOWEDThe sensitive parameter value is not allowed.
Public fieldStatic memberDTS_E_EXTENDFAILEDThe buffer manager cannot extend the file "%1" to length %2!lu!. There was insufficient disk space.
Public fieldStatic memberDTS_E_EXTERNALCOLUMNMETADATACODEPAGEMISMATCHThe code page on %1 is %2!d! and is required to be %3!d!.
Public fieldStatic memberDTS_E_EXTERNALMETADATACOLUMNISALREADYMAPPEDThe external metadata column with ID %1!d! has already been mapped to %2.
Public fieldStatic memberDTS_E_EXTRACTORCANTAPPENDTRUNCATEError caused by conflicting property settings. The "%1" has both the AllowAppend property and the ForceTruncate property set to TRUE. Both properties cannot be set to TRUE. Set one of the two properties to FALSE.
Public fieldStatic memberDTS_E_EXTRACTORCANTWRITEWriting to the file "%1" failed with error code 0x%2!8.8X!.
Public fieldStatic memberDTS_E_EXTRACTORCOLUMNALREADYREFERENCEDThe %1 references column ID %2!d!, but that column is already referenced by %3. Remove one of the two reference to the column.
Public fieldStatic memberDTS_E_EXTRACTORDATACOLUMNNOTBLOBThe "%1" references "%2", and that column is not of a BLOB type.
Public fieldStatic memberDTS_E_EXTRACTORFILENAMECOLUMNNOTSTRINGThe "%1" should contain a file name, but it is not of a String type.
Public fieldStatic memberDTS_E_EXTRACTORINVALIDCOLUMNDATATYPEThe %1 has an unsupported data type. It must be DT_STR, DT_WSTR, DT_TEXT, DT_NTEXT, or DT_IMAGE.
Public fieldStatic memberDTS_E_EXTRACTORREFERENCEDCOLUMNNOTFOUNDThe "%1" references column ID %2!d!, and that column is not found on the input. A reference points to a non-existent column.
Public fieldStatic memberDTS_E_EXTRACTORUNREFERENCEDThe "%1" is marked read-only, but is not referenced by any other column. Unreferenced columns are not allowed.
Public fieldStatic memberDTS_E_FAILED_EXECUTE_IS_SERVER_PACKAGEThe failed execution is a server package.
Public fieldStatic memberDTS_E_FAILEDCOLUMNDATACONVERSIONSTATUSData conversion failed. The data conversion for column "%1" returned status value %2!d! and status text "%3".
Public fieldStatic memberDTS_E_FAILEDCREATEXMLDOCUMENTFailed to create an XML document "%1".
Public fieldStatic memberDTS_E_FAILEDDEPENDENCIESThere was an error enumerating the package dependencies. Check other messages for more information.
Public fieldStatic memberDTS_E_FAILEDDURINGOLEDBDATATYPECONVERSIONCHECKThe OLE DB provider failed during the data type conversion verification for "%1".
Public fieldStatic memberDTS_E_FAILEDGETTYPEINFOThe object does not support type information. This occurs when the runtime attempts to get the type information from an object to populate the Properties collection. The object must support type information.
Public fieldStatic memberDTS_E_FAILEDPOPNATIVEFEEFailed to populate the ForEachEnumeratorInfos collection with native ForEachEnumerators with the following error code: %1.
Public fieldStatic memberDTS_E_FAILEDPROPERTYGETAn error occurred while retrieving the value of property "%1". The error code is 0x%2!8.8X!.
Public fieldStatic memberDTS_E_FAILEDPROPERTYGET_ERRORINFOAn error occurred while retrieving the value of property "%1". The error code is 0x%2!8.8X! "%3".
Public fieldStatic memberDTS_E_FAILEDPROPERTYSETAn error occurred while setting the value of property "%1". The error returned is 0x%2!8.8X!.
Public fieldStatic memberDTS_E_FAILEDPROPERTYSET_ERRORINFOAn error occurred while setting the value of property "%1". The error returned is 0x%2!8.8X! "%3".
Public fieldStatic memberDTS_E_FAILEDSETEXECVALVARIABLEThe wrapper was unable to set the value of the variable specified in the ExecutionValueVariable property.
Public fieldStatic memberDTS_E_FAILEDSYSTEMVARIABLEREMOVEFailed to remove a system variable. This error occurs when removing a variable that is a required variable. Required variables are variables that are created by the runtime for communicating between tasks and the runtime.
Public fieldStatic memberDTS_E_FAILEDTOACCESSLOBCOLUMNFailed to access LOB data from the data flow buffer for data source column "%1" with error code 0x%2!8.8X!.
Public fieldStatic memberDTS_E_FAILEDTOALLOCATEROWHANDLEBUFFERThe attempt to allocate a row handle buffer failed with error code 0x%1!8.8X!.
Public fieldStatic memberDTS_E_FAILEDTOBUFFERROWSTARTSThe attempt to retrieve the start of the buffer row failed with error code 0x%1!8.8X!.
Public fieldStatic memberDTS_E_FAILEDTOCREATEEXPRESSIONARRAYMemory cannot be allocated for the Expression objects. An out-of-memory error occurred while creating the array of Expression object pointers.
Public fieldStatic memberDTS_E_FAILEDTOCREATEEXPRESSIONMANANGERThe %1 failed with error code 0x%2!8.8X! while creating the Expression Manager.
Public fieldStatic memberDTS_E_FAILEDTODIRECTERRORROWDirecting the row to the error output failed with error code 0x%1!8.8X!.
Public fieldStatic memberDTS_E_FAILEDTOFINDCOLUMNBYLINEAGEIDAn attempt to find %1 with lineage ID %2!d! in the Data Flow Task buffer failed with error code 0x%3!8.8X!.
Public fieldStatic memberDTS_E_FAILEDTOFINDCOLUMNINBUFFERFailed to find column "%1" with lineage ID %2!d! in the buffer. The buffer manager returned error code 0x%3!8.8X!.
Public fieldStatic memberDTS_E_FAILEDTOFINDERRORCOLUMNAn error occurred, but the column that caused the error cannot be determined.
Public fieldStatic memberDTS_E_FAILEDTOFINDNONSPECIALERRORCOLUMNFailed to find any non-special error column in %1.
Public fieldStatic memberDTS_E_FAILEDTOGETBUFFERBOUNDARYINFOThe attempt to get buffer boundary information failed with error code 0x%1!8.8X!.
Public fieldStatic memberDTS_E_FAILEDTOGETCOLINFOFailed to get information for row %1!ld!, column %2!ld! from the buffer. The error code returned was 0x%3!8.8X!.
Public fieldStatic memberDTS_E_FAILEDTOGETCOLUMNINFOFROMBUFFERFailed to get information for column "%1" (%2!d!) from the buffer. The error code returned was 0x%3!8.8X!.
Public fieldStatic memberDTS_E_FAILEDTOGETCOMPONENTLOCALEIDFailure retrieving component locale ID. Error code 0x%1!8.8X!.
Public fieldStatic memberDTS_E_FAILEDTOGETCONNECTIONSTRINGFailed to get the connection string.
Public fieldStatic memberDTS_E_FAILEDTOGETDATAFORERROROUTPUTBUFFERFailed to get data for the error output buffer.
Public fieldStatic memberDTS_E_FAILEDTOGETFILESIZEAn error occurred while getting the file size for file "%1".
Public fieldStatic memberDTS_E_FAILEDTOGETLOCALEIDFROMPACKAGEThe %1 failed to get the locale ID from the package.
Public fieldStatic memberDTS_E_FAILEDTOINITIALIZEFLATFILEPARSERAn error occurred while initializing the flat file parser.
Public fieldStatic memberDTS_E_FAILEDTOLOADCACHEFailed to load the cache from file, "__".
Public fieldStatic memberDTS_E_FAILEDTOPREPAREBUFFERSTATUSThe attempt to prepare the buffer status failed with error code 0x%1!8.8X!.
Public fieldStatic memberDTS_E_FAILEDTOPREPARECOLUMNSTATUSESFORINSERTPreparing column statuses for insert failed with error code 0x%1!8.8X!.
Public fieldStatic memberDTS_E_FAILEDTOREMOVEROWFROMBUFFERRemoving a row from the buffer failed with error code 0x%1!8.8X!.
Public fieldStatic memberDTS_E_FAILEDTOSENDROWTOSQLSERVERThe attempt to send a row to SQL Server failed with error code 0x%1!8.8X!.
Public fieldStatic memberDTS_E_FAILEDTOSETBUFFERENDOFROWSETSetting the end of row set for the buffer failed with error code 0x%1!8.8X!.
Public fieldStatic memberDTS_E_FAILEDTOSETBUFFERERRORINFOThe attempt to set buffer error information failed with error code 0x%1!8.8X!.
Public fieldStatic memberDTS_E_FAILEDTOSETCOLINFOFailed to set information for row %1!ld!, column %2!ld! into the buffer. The error code returned was 0x%3!8.8X!.
Public fieldStatic memberDTS_E_FAILEDTOSETFILEPOINTERAn error occurred while setting the file pointer for file "%1".
Public fieldStatic memberDTS_E_FAILEDTOSETOUTPUTCOLUMNDATATYPEPROPERTIESAttempt to set the data type properties on "%1" failed with error code 0x%2!8.8X!. The error occurred while attempting to set one or more of the data type properties of the output column.
Public fieldStatic memberDTS_E_FAILEDTOSETOUTPUTCOLUMNTYPEFailed to set the type of %1 to type: "%2", length: %3!d!, precision: %4!d!, scale: %5!d!, code page: %6!d!.
Public fieldStatic memberDTS_E_FAILEDTOSETPROPERTYFailed to set property "%1" on "%2".
Public fieldStatic memberDTS_E_FAILEDTOSETUSAGETYPEThe "%1" was unable to make the requested change to the input column with lineage ID %2!d!. The request failed with error code 0x%3!8.8X!. The specified error occurred while attempting to set the usage type of an input column.
Public fieldStatic memberDTS_E_FAILEDTOWRITEOUTCOLUMNNAMEFailed to write out column name for column "%1".
Public fieldStatic memberDTS_E_FAILEDTOWRITEOUTHEADERAn error occurred while writing out the file header.
Public fieldStatic memberDTS_E_FAILEDTOWRITETOTHEFILENAMECOLUMNThe attempt to write to the filename column failed with error code 0x%1!8.8X!.
Public fieldStatic memberDTS_E_FAILLOADINGPROPERTYFailed to load the value property "%1" using default persistence.
Public fieldStatic memberDTS_E_FAILPACKAGEONFAILURENAFailPackageOnFailure property is not applicable to the package container.
Public fieldStatic memberDTS_E_FAILTOCREATEMUTEXFailed to create mutex "__" with error __.
Public fieldStatic memberDTS_E_FAILTORELEASEMUTEXFailed to release mutex "__" with error __.
Public fieldStatic memberDTS_E_FASTPARSENOTALLOWEDThe "%1" custom property for "%2" cannot be set to true. The column data type must be one of the following: DT_I1, DT_I2, DT_I4, DT_I8, DT_UI1, DT_UI2, DT_UI4, DT_UI8, DT_DBTIMESTAMP, DT_DATE, DT_DBDATE, DT_DBTIME, or DT_FILETIME.
Public fieldStatic memberDTS_E_FG_COPY_INPUTFuzzy Grouping transformation failed to copy input.
Public fieldStatic memberDTS_E_FG_FUZZY_MATCH_ON_NONSTRINGA fuzzy match is specified on column "%1" (%2!d!) that is not a data type of DT_STR or DT_WSTR.
Public fieldStatic memberDTS_E_FG_GENERATE_GROUPSFuzzy Grouping transformation failed to generate groups.
Public fieldStatic memberDTS_E_FG_LEADING_TRAILINGAn unexpected error occurred in Fuzzy Grouping when applying the settings of property '%1'.
Public fieldStatic memberDTS_E_FG_MISSING_OUTPUT_COLUMNSSpecial transformation-specific columns are either missing or have incorrect types.
Public fieldStatic memberDTS_E_FG_NOBLOBSFuzzy Grouping does not support input columns of type IMAGE, TEXT, or NTEXT.
Public fieldStatic memberDTS_E_FG_PICK_CANONICALThe Fuzzy Grouping transformation failed to pick a canonical row of data to use in standardizing the data.
Public fieldStatic memberDTS_E_FG_PREPARE_TABLES_AND_ACCESSORSFuzzy Grouping transformation failed to create required tables and accessors.
Public fieldStatic memberDTS_E_FILENAMEINVALIDThe file name is not valid. The file name is a device or contains invalid characters.
Public fieldStatic memberDTS_E_FILENAMEINVALIDWITHPARAMThe file name "%1" is not valid. The file name is a device or contains invalid characters.
Public fieldStatic memberDTS_E_FILENAMEOUTPUTCOLUMNINVALIDDATATYPEThe output column for the file name is not a null-terminated Unicode character string, which is data type DT_WSTR.
Public fieldStatic memberDTS_E_FILENAMEOUTPUTCOLUMNOTFOUNDThe output column for the file name cannot be found.
Public fieldStatic memberDTS_E_FILEOPENERR_FORREADOpening the file "%1" for reading failed with error code 0x%2!8.8X!.
Public fieldStatic memberDTS_E_FILEOPENERR_FORREAD_ACCESSDENIEDAttempting to open the file "%1" for reading failed. Access is denied.
Public fieldStatic memberDTS_E_FILEOPENERR_FORREAD_FILENOTFOUNDOpening the file "%1" for reading failed. The file was not found.
Public fieldStatic memberDTS_E_FILEOPENERR_FORREAD_PATHNOTFOUNDOpening the file "%1" for reading failed. The path cannot be found.
Public fieldStatic memberDTS_E_FILEOPENERR_FORREAD_TOOMANYOPENFILESOpening the file "%1" for reading failed. There are too many files open.
Public fieldStatic memberDTS_E_FILEOPENERR_FORWRITEOpening the file "%1" for writing failed with error code 0x%2!8.8X!.
Public fieldStatic memberDTS_E_FILEOPENERR_FORWRITE_ACCESSDENIEDOpening the file "%1" for writing failed. You do not have the correct permissions.
Public fieldStatic memberDTS_E_FILEOPENERR_FORWRITE_FILEEXISTSOpening the file "%1" for writing failed. The file exists and cannot be overwritten. If the AllowAppend property is FALSE and the ForceTruncate property is set to FALSE, the existence of the file will cause this failure.
Public fieldStatic memberDTS_E_FILEOPENERR_FORWRITE_FILENOTFOUNDOpening the file "%1" for writing failed. The file cannot be found.
Public fieldStatic memberDTS_E_FILEOPENERR_FORWRITE_PATHNOTFOUNDOpening the file "%1" for writing failed. The path cannot be found.
Public fieldStatic memberDTS_E_FILEOPENERR_FORWRITE_TOOMANYOPENFILESOpening the file "%1" for writing failed. There are too many files open.
Public fieldStatic memberDTS_E_FILEREADFAILEDThe buffer manager cannot read %1!d! bytes from file "%2". The file is damaged.
Public fieldStatic memberDTS_E_FILEWRITEERR_DISKFULLOpening the file "%1" for writing failed because the disk is full. There is not sufficient disk space to save this file.
Public fieldStatic memberDTS_E_FILEWRITEFAILEDThe buffer manager cannot write %1!d! bytes to file "%2". There was insufficient disk space or quota.
Public fieldStatic memberDTS_E_FINDFOLDERONSQLSERVER_OLEDBWhile trying to find a folder on SQL an OLE DB error was encountered with error code 0x%1!8.8X! (%2).
Public fieldStatic memberDTS_E_FLATFILEFORMATNOTSUPPORTEDFormat "%1" is not supported by Flat File Connection Manager. Supported formats are Delimited, FixedWidth, RaggedRight, and Mixed.
Public fieldStatic memberDTS_E_FLATFILESOURCEADAPTERSTATIC_CANTCONVERTVALUEThe data value cannot be converted for reasons other than sign mismatch or data overflow.
Public fieldStatic memberDTS_E_FLATFILESOURCEADAPTERSTATIC_DATAOVERFLOWConversion failed because the data value overflowed the type used by the flat file source adapter.
Public fieldStatic memberDTS_E_FLATFILESOURCEADAPTERSTATIC_SIGNMISMATCHConversion failed because the data value was signed and the type used by the flat file source adapter was unsigned.
Public fieldStatic memberDTS_E_FLATFILESOURCEADAPTERSTATIC_TRUNCATEDThe data was truncated.
Public fieldStatic memberDTS_E_FLATFILESOURCEADAPTERSTATIC_UNAVAILABLENo status is available.
Public fieldStatic memberDTS_E_FOLDERADDFAILEDAn error was encountered when trying to create a folder on SQL Server named "%1" in folder "%2".
Public fieldStatic memberDTS_E_FOLDERDELETEFAILEDError deleting SQL Server folder "%1".
Public fieldStatic memberDTS_E_FOLDERNOTFOUNDCannot find folder "%1".
Public fieldStatic memberDTS_E_FOLDERRENAMEFAILEDAn error occurred when renaming folder " %1\\%2" to "%1\\%3" on SQL Server.
Public fieldStatic memberDTS_E_FORBIDDENServer returned error code "403 - Forbidden". This error can occur when the specified resource needs "https" access, but the certificate validity period has expired, the certificate is not valid for the use requested, or the certificate has been revoked or revocation cannot be checked.
Public fieldStatic memberDTS_E_FOREACHVARIABLEMAPPINGForEach Variable Mapping number %1!d! to variable "%2" cannot be applied.
Public fieldStatic memberDTS_E_FORLOOPASSIGNEXPRESSIONINVALIDThe assignment expression for the loop is not valid and needs to be modified. There should be additional error messages.
Public fieldStatic memberDTS_E_FORLOOPEVALEXPRESSIONINVALIDThe evaluation expression for the loop is not valid. The expression needs to be modified. There should be additional error messages.
Public fieldStatic memberDTS_E_FORLOOPHASNOEXPRESSIONThere is no expression for the loop to evaluate. This error occurs when the expression on the For Loop is empty. Add an expression.
Public fieldStatic memberDTS_E_FORLOOPINITEXPRESSIONINVALIDThe initialization expression for the loop is not valid and needs to be modified. There should be additional error messages.
Public fieldStatic memberDTS_E_FOUNDORPHANEDEXTERNALMETADATACOLUMNThe %1 does not have a corresponding input or output column.
Public fieldStatic memberDTS_E_FROMEXECISNOTCHILDWhen adding a precedence constraint, a From executable was specified that is not a child of this container.
Public fieldStatic memberDTS_E_FSTASK_CANTCREATEDIRCannot create directory. User chose to fail the task if directory exists.
Public fieldStatic memberDTS_E_FSTASK_CONNECTIONTYPENOTFILEType of Connection "%1" is not a file.
Public fieldStatic memberDTS_E_FSTASK_DESTCONNUSAGETYPEINVALIDThe destination file connection manager "%1" has an invalid usage type: "%2".
Public fieldStatic memberDTS_E_FSTASK_DESTINATIONISEMPTYThe destination is empty.
Public fieldStatic memberDTS_E_FSTASK_DESTINATIONNOTSETDestination property of operation "%1" not set.
Public fieldStatic memberDTS_E_FSTASK_DIRECTORYDELETEDDirectory "%1" was deleted.
Public fieldStatic memberDTS_E_FSTASK_DIRECTORYEXISTSThe Directory already exists.
Public fieldStatic memberDTS_E_FSTASK_FILEDELETEDFile or directory "%1" was deleted.
Public fieldStatic memberDTS_E_FSTASK_FILEDIRNOTFOUNDFile or directory "%1" does not exist.
Public fieldStatic memberDTS_E_FSTASK_FILEDOESNOTEXISTFile or directory "%1" represented by connection "%2" does not exist.
Public fieldStatic memberDTS_E_FSTASK_INVALIDDATAThe File System task received an invalid task data node.
Public fieldStatic memberDTS_E_FSTASK_INVALIDDESTPATHInvalid destination path.
Public fieldStatic memberDTS_E_FSTASK_LOGENTRYGETTINGFILEOPERATIONThe FileSystemOperation.
Public fieldStatic memberDTS_E_FSTASK_LOGENTRYGETTINGFILEOPERATIONDESCProvides information regarding File System operations.
Public fieldStatic memberDTS_E_FSTASK_NOATTRIBUTESETNo attribute set.
Public fieldStatic memberDTS_E_FSTASK_PATHNOTVALID"%1" is not valid on operation type "%2".
Public fieldStatic memberDTS_E_FSTASK_SOURCEISEMPTYThe source is empty.
Public fieldStatic memberDTS_E_FSTASK_SOURCENOTSETSource property of operation "%1" not set.
Public fieldStatic memberDTS_E_FSTASK_SRCCONNUSAGETYPEINVALIDThe source file connection manager "%1" has an invalid usage type "%2".
Public fieldStatic memberDTS_E_FSTASK_SYNCFAILEDSynchronization object failed.
Public fieldStatic memberDTS_E_FSTASK_TASKDESCRIPTIONPerform file system operations, such as copying and deleting files.
Public fieldStatic memberDTS_E_FSTASK_TASKDISPLAYNAMEThe File System Task.
Public fieldStatic memberDTS_E_FSTASK_VARIABLEDOESNTEXISTVariable "%1" does not exist.
Public fieldStatic memberDTS_E_FSTASK_VARIABLENOTASTRINGVariable "%1" is not a string.
Public fieldStatic memberDTS_E_FSTASK_VARSRCORDESTISEMPTYVariable "%1" is used as a source or destination and is empty.
Public fieldStatic memberDTS_E_FTPCHANGEFOLDERChanging current directory to "%1". %2.
Public fieldStatic memberDTS_E_FTPCREATEFOLDERCreating folder "%1" ... %2.
Public fieldStatic memberDTS_E_FTPDELETEFOLDERDeleting folder "%1" ... %2.
Public fieldStatic memberDTS_E_FTPERRORAn error occurred in the requested FTP operation. Detailed error description: %1.
Public fieldStatic memberDTS_E_FTPFILESEMPTYNo files to transfer. This error can occur when performing a Send or Receive operation and no files are specified for the transfer.
Public fieldStatic memberDTS_E_FTPINVALIDCONNECTIONSTRINGThe port specified in the connection string is not valid. The ConnectionString format is ServerName:Port. Port should be an integer value between %1!d! and %2!d!.
Public fieldStatic memberDTS_E_FTPINVALIDLOCALPATHSpecified local path is not valid. Specify a valid local path. This can occur when the specified local path is null.
Public fieldStatic memberDTS_E_FTPINVALIDPORTThe FTP Port contains an invalid value. The FTP Port value should be an integer between %1!d! and %2!d!.
Public fieldStatic memberDTS_E_FTPINVALIDRETRIESThe number of retries is not valid. The number of retries should be between %1!d! and %2!d!.
Public fieldStatic memberDTS_E_FTPNOFILESTODELETENo files specified to delete.
Public fieldStatic memberDTS_E_FTPNOTCONNECTEDConnection with the FTP server has not been established.
Public fieldStatic memberDTS_E_FTPTASK__INITIALIZATION_WITH_NULL_XML_ELEMENTCannot initialize the task with a null XML element.
Public fieldStatic memberDTS_E_FTPTASK_CANNOTACQUIRECONNECTIONThere was an error acquiring the FTP connection. Verify that a valid connection type is specified in "%1".
Public fieldStatic memberDTS_E_FTPTASK_CONNECTION_NAME_NULLThe connection is empty. Verify that a valid FTP connection is provided.
Public fieldStatic memberDTS_E_FTPTASK_CONNECTION_NOT_FTPThe connection specified is not an FTP connection. Verify that a valid FTP connection is provided.
Public fieldStatic memberDTS_E_FTPTASK_CONNECTIONNOTFOUNDThe FTP connection manager "%1" cannot be found.
Public fieldStatic memberDTS_E_FTPTASK_CONNECTIONTYPENOTFILEType of Connection "%1" is Not a file.
Public fieldStatic memberDTS_E_FTPTASK_DIRECTORYEXISTS"%1" already exists.
Public fieldStatic memberDTS_E_FTPTASK_ERROR_IN_LOAD_FROM_XMLError occurred in LoadFromXML at the tag "%1".
Public fieldStatic memberDTS_E_FTPTASK_FILECONNECTIONNOTFOUNDFor the FTP operation "%1", the FILE connection manager "%2" cannot be found.
Public fieldStatic memberDTS_E_FTPTASK_FILEDOESNOTEXISTFile represented by "%1" does not exist.
Public fieldStatic memberDTS_E_FTPTASK_FILEUSAGETYPEERRORFile usage type of connection "%1" should be "%2" for operation "%3".
Public fieldStatic memberDTS_E_FTPTASK_FTPRCVDINVLDDATANODEThe FTP task received an invalid task data node.
Public fieldStatic memberDTS_E_FTPTASK_INVALIDDIRECTORYDirectory is not specified in the variable "%1".
Public fieldStatic memberDTS_E_FTPTASK_INVALIDPATHONOPERATIONInvalid path on operation "%1".
Public fieldStatic memberDTS_E_FTPTASK_INVALIDREMOTEPATHRemote path "%1" doesn't start with "/".
Public fieldStatic memberDTS_E_FTPTASK_INVALIDVARIABLEVALUEVariable "%1" doesn't start with "/".
Public fieldStatic memberDTS_E_FTPTASK_LOCALPATHEMPTYThe local path is empty.
Public fieldStatic memberDTS_E_FTPTASK_LOCALVARIABLEISEMPTYThe variable "%1" is empty.
Public fieldStatic memberDTS_E_FTPTASK_LOCALVARIBALEEMPTYThe local variable is empty.
Public fieldStatic memberDTS_E_FTPTASK_NODIRECTORYPATHINCONMGRDirectory is not specified in the file connection manager "%1".
Public fieldStatic memberDTS_E_FTPTASK_NOFILEPATHSINLOCALVARThe variable "%1" doesn't contain file path(s).
Public fieldStatic memberDTS_E_FTPTASK_NOFILESATLOCATIONThere are no files at "%1".
Public fieldStatic memberDTS_E_FTPTASK_NOFILESFOUNDNo files found in "%1".
Public fieldStatic memberDTS_E_FTPTASK_NOFILESINCONNMGRThe File "%1" doesn't contain file path(s).
Public fieldStatic memberDTS_E_FTPTASK_REMOTEPATHEMPTYThe remote path is empty.
Public fieldStatic memberDTS_E_FTPTASK_REMOTEVARIABLEISEMPTYThe variable "%1" is empty.
Public fieldStatic memberDTS_E_FTPTASK_REMOTEVARIBALEEMPTYThe remote variable is empty.
Public fieldStatic memberDTS_E_FTPTASK_SAVE_TO_NULL_XML_ELEMENTCannot save the task to a null XML document.
Public fieldStatic memberDTS_E_FTPTASK_SYNCOBJFAILEDSynchronization object failed.
Public fieldStatic memberDTS_E_FTPTASK_UNABLETOCONNECTTOSERVERUnable to connect to FTP server using "%1".
Public fieldStatic memberDTS_E_FTPTASK_UNABLETOCREATELOCALDIRECTORYUnable to create local directory "%1".
Public fieldStatic memberDTS_E_FTPTASK_UNABLETODELETELOCALEFILEUnable to delete local file "%1".
Public fieldStatic memberDTS_E_FTPTASK_UNABLETODELETEREMOTEFILESUnable to delete remote files using "%1".
Public fieldStatic memberDTS_E_FTPTASK_UNABLETOMAKEDIRREMOTEUnable to create remote directory using "%1".
Public fieldStatic memberDTS_E_FTPTASK_UNABLETOOBTAINFILELISTUnable to obtain the file list.
Public fieldStatic memberDTS_E_FTPTASK_UNABLETORECEIVEFILESUnable to receive files using "%1".
Public fieldStatic memberDTS_E_FTPTASK_UNABLETOREMOVEDIRREMOTEUnable to remove remote directory using "%1".
Public fieldStatic memberDTS_E_FTPTASK_UNABLETOREMOVELOCALDIRECTORYUnable to remove local directory "%1".
Public fieldStatic memberDTS_E_FTPTASK_UNABLETOSENDFILESUnable to send files using "%1".
Public fieldStatic memberDTS_E_FTPTASK_VARIABLENOTASTRINGVariable "%1" is not a string.
Public fieldStatic memberDTS_E_FTPTASK_VARIABLENOTFOUNDVariable "%1" does not exist.
Public fieldStatic memberDTS_E_FUNDAMENTALLOADINGERRORUnable to load the package as XML because of package does not have a valid XML format. A specific XML parser error will be posted.
Public fieldStatic memberDTS_E_FUZZYGROUPINGINTERNALPIPELINEERRORA Fuzzy Grouping transformation pipeline error occurred and returned error code 0x%1!8.8X!: "%2".
Public fieldStatic memberDTS_E_FUZZYLOOKUP_REFERENCECACHEFULLFuzzy Lookup was unable to load the entire reference table into main memory as is required when the Exhaustive property is enabled. Either we ran out of system memory or a limit was specified for MaxMemoryUsage which was not sufficient to load the reference table. Either set MaxMemoryUsage to 0 or increase it significantly. Alternatively, disable Exhaustive.
Public fieldStatic memberDTS_E_FUZZYLOOKUPREFTABLETOOBIGThe reference table specified has too many rows. Fuzzy Lookup only works with reference tables having less than 1 billion rows. Consider using a smaller view of your reference table.
Public fieldStatic memberDTS_E_FUZZYLOOKUPUNABLETODELETEEXISTINGMATCHINDEXAn error was encountered when trying to delete the existing fuzzy match index named "%1". It is possible that this table was not created by Fuzzy Lookup (or this version of Fuzzy Lookup), it has been damaged, or there is another problem. Try manually deleting the table named "%2" or specify a different name for the MatchIndexName property.
Public fieldStatic memberDTS_E_FUZZYLOOKUPUNABLETODETERMINEREFERENCETABLESIZEUnable to determine the size of the reference table '%1'. It is possible that this object is a view and not a table. Fuzzy Lookup does not support views when CopyReferentaceTable=false. Make sure that the table exists and that CopyReferenceTable=true.
Public fieldStatic memberDTS_E_GENERICERROROne or more error occurred. There should be more specific errors preceding this one that explains the details of the errors. This message is used as a return value from functions that encounter errors.
Public fieldStatic memberDTS_E_GETCATMANAGERFAILEDFailed to get the cat manager.
Public fieldStatic memberDTS_E_GETCONNECTIONINFOSFailed to get ConnectionInfos collection with error 0x%1!8.8X! "%2". This error occurs when the call to IDTSApplication100::get_ConnectionInfos fails.
Public fieldStatic memberDTS_E_GETENUMERATORThe GetEnumerator method of the ForEach Enumerator has failed with error 0x%1!8.8X! "%2". This occurs when the ForEach Enumerator cannot enumerate.
Public fieldStatic memberDTS_E_GETKEYFROMCERTFAILEDFailed to obtain cryptographic key pair associated with the specified certificate with error 0x%1!8.8X! "%2". Verify that you have the key pair for which the certificate was issued. This error usually occurs when trying to sign a document using a certificate for which the person does not have the private key.
Public fieldStatic memberDTS_E_GETPACKAGEINFOSAn OLE DB error 0x%1!8.8X! (%2) occurred while enumerating packages. A SQL statement was issued and failed.
Public fieldStatic memberDTS_E_GETRTINTERFACEFAILEDThe component "%1" (%2!d!) cannot provide an IDTSRuntimeComponent100 interface.
Public fieldStatic memberDTS_E_GETSCHEMATABLEFAILEDThe __ was unable to retrieve column information for the SQL command. The following error occurred: __
Public fieldStatic memberDTS_E_GETXMLSOURCEFAILEDFailed to obtain XML source from XML DOM object with error 0x%1!8.8X! "%2". This occurs when IXMLDOMDocument::get_xml fails.
Public fieldStatic memberDTS_E_HASEMPTYTASKHOSTSThe package cannot execute because it contains tasks that failed to load.
Public fieldStatic memberDTS_E_HASHTABLE_SIZEOVERFLOWThe size of the hash table overflowed.
Public fieldStatic memberDTS_E_HASSIDEEFFECTSWITHSYNCINPThe "%1" has the HasSideEffects property set to TRUE, but "%1" is synchronous and cannot have side effects. Set the HasSideEffects property to FALSE.
Public fieldStatic memberDTS_E_HIDEPROJCONNECTION_NAMECONFLICTHides project connection on name conflict.
Public fieldStatic memberDTS_E_ICONVERTTYPEUNAVAILABLEThe OLE DB provider used by the OLE DB adapter does not support IConvertType. Set the adapter's ValidateColumnMetaData property to FALSE.
Public fieldStatic memberDTS_E_IDNOTINPUTNOROUTPUTThe ID, %1!lu!, is neither an input ID nor an output ID. The specified ID must be the input ID or the output ID that the external metadata collection is associated with.
Public fieldStatic memberDTS_E_IDTSNAMENOTSUPPORTEDThe object does not inherit from IDTSName100.
Public fieldStatic memberDTS_E_ILLEGALCUSTOMOUTPUTPROPERTYThe output %1 cannot not have property "%2", but currently has that property assigned.
Public fieldStatic memberDTS_E_IMAGEDATATYPENOTSUPPORTEDThe data type for "%1" is DT_IMAGE, which is not supported. Use DT_TEXT or DT_NTEXT instead and convert the data from, or to, DT_IMAGE using the data conversion component.
Public fieldStatic memberDTS_E_INCOMPATIBLETRANSACTIONCONTEXTIncompatible transaction context was specified for a retained connection. This connection has been established under a different transaction context. Retained connections can be used under exactly one transaction context.
Public fieldStatic memberDTS_E_INCOMPLETEDATASOURCECOLUMNFOUNDComplete metadata information for the data source column "%1" is not available. Make sure the column is correctly defined in the data source.
Public fieldStatic memberDTS_E_INCORRECT_SQL_SERVER_VERSIONThe DBMS type or version of "%1" is not supported. A connection to Microsoft SQL Server version 8.0 or later is required. This occurs if IDBProperties on the connection did not return a the correct version.
Public fieldStatic memberDTS_E_INCORRECTCOLUMNCOUNTThe number of columns is incorrect.
Public fieldStatic memberDTS_E_INCORRECTCOMPONENTVIEWIDThe component view ID is incorrect. The component view may be out of synchronization. Try releasing the component view and recreating it.
Public fieldStatic memberDTS_E_INCORRECTCONNECTIONMANAGERTYPEThe connection manager "%1" is an incorrect type. The type required is "%2". The type available to the component is "%3".
Public fieldStatic memberDTS_E_INCORRECTCONNECTIONOBJECTTYPEThe connection manager "%1" returned an object of an incorrect type from the AcquireConnection method.
Public fieldStatic memberDTS_E_INCORRECTCUSTOMPROPERTYTYPEThe custom property "%1" needs to be of type %2.
Public fieldStatic memberDTS_E_INCORRECTCUSTOMPROPERTYVALUEThe value for custom property "%1" is incorrect.
Public fieldStatic memberDTS_E_INCORRECTCUSTOMPROPERTYVALUEFOROBJECTThe value for custom property "%1" on %2 is incorrect.
Public fieldStatic memberDTS_E_INCORRECTEXACTNUMBEROFINPUTSThe number of inputs is incorrect. There must be exactly %1!d! inputs.
Public fieldStatic memberDTS_E_INCORRECTEXACTNUMBEROFOUTPUTSThe number of outputs is incorrect. There must be exactly %1!d! output(s).
Public fieldStatic memberDTS_E_INCORRECTINPUTCACHECOLCOUNTThe number of input columns does not match the number of cache columns.
Public fieldStatic memberDTS_E_INCORRECTMINIMUMNUMBEROFOUTPUTSThe number of outputs is incorrect. There must be at least %1!d! outputs.
Public fieldStatic memberDTS_E_INCORRECTPARAMETERMAPPINGFORMATThe parameter mapping string is not in the correct format.
Public fieldStatic memberDTS_E_INCORRECTSTOCKPROPERTYThe value for property "%1" on "%2" is not valid.
Public fieldStatic memberDTS_E_INCORRECTSTOCKPROPERTYVALUEThe value of the property "%1" is incorrect.
Public fieldStatic memberDTS_E_INDIVIDUALCACHEINTERFACESFAILED%1 failed initialization and returned error code 0x%2!8.8X!.
Public fieldStatic memberDTS_E_INDIVIDUALCHECKPRODUCTLEVELFAILEDThe %1 failed to be able to perform its required product level check and returned error code 0x%2!8.8X!.
Public fieldStatic memberDTS_E_INDIVIDUALCLEANUPFAILED%1 failed the cleanup phase and returned error code 0x%2!8.8X!.
Public fieldStatic memberDTS_E_INDIVIDUALPOSTEXECUTEFAILED%1 failed the post-execute phase and returned error code 0x%2!8.8X!.
Public fieldStatic memberDTS_E_INDIVIDUALPREEXECUTEFAILED%1 failed the pre-execute phase and returned error code 0x%2!8.8X!.
Public fieldStatic memberDTS_E_INDIVIDUALPREPAREFAILED%1 failed the prepare phase and returned error code 0x%2!8.8X!.
Public fieldStatic memberDTS_E_INDIVIDUALPUTCOMPONENTMETADATAFAILEDThe "%1" failed to cache the component metadata object and returned error code 0x%2!8.8X!.
Public fieldStatic memberDTS_E_INDIVIDUALPUTEVENTINFOSFAILEDThe EventInfos collection could not be cached by "%1" and returned error code 0x%2!8.8X!.
Public fieldStatic memberDTS_E_INDIVIDUALPUTLOGENTRYINFOS"%1" failed to cache the LogEntryInfos collection and returned error code 0x%2!8.8X!.
Public fieldStatic memberDTS_E_INDIVIDUALPUTREFTRACKERFAILEDComponent "%1" failed to cache the runtime object reference tracker collection and returned error code 0x%2!8.8X!.
Public fieldStatic memberDTS_E_INDIVIDUALPUTVARIABLESFAILEDThe "%1!s!" cannot cache the Variables collection and returned error code 0x%2!8.8X.
Public fieldStatic memberDTS_E_INDIVIDUALRELEASEINTERFACESFAILED%1 failed during shut down and returned error code 0x%2!8.8X!. A component failed to release its interfaces.
Public fieldStatic memberDTS_E_INDIVIDUALVALIDATIONFAILED%1 failed validation and returned error code 0x%2!8.8X!.
Public fieldStatic memberDTS_E_INDIVIDUALVALIDATIONSTATUSFAILED"%1" failed validation and returned validation status "%2".
Public fieldStatic memberDTS_E_INDUCEDTRANSFORMFAILUREONERRORSSIS Error Code DTS_E_INDUCEDTRANSFORMFAILUREONERROR. The "%1" failed because error code 0x%2!8.8X! occurred, and the error row disposition on "%3" specifies failure on error. An error occurred on the specified object of the specified component. There may be error messages posted before this with more information about the failure.
Public fieldStatic memberDTS_E_INDUCEDTRANSFORMFAILUREONTRUNCATIONThe "%1" failed because truncation occurred, and the truncation row disposition on "%2" specifies failure on truncation. A truncation error occurred on the specified object of the specified component.
Public fieldStatic memberDTS_E_INITTASKOBJECTFAILEDSpecifies that the initialized task object has failed.
Public fieldStatic memberDTS_E_INPUTCOLPROPERTYNOTFOUNDThe "%3" property is required on input column "%1" (%2!d!), but is not found. The missing property should be added.
Public fieldStatic memberDTS_E_INPUTCOLUMNBADMAPThe %1 has a mapping that is not valid. An output column with an ID of %2!ld! does not exist on this component.
Public fieldStatic memberDTS_E_INPUTCOLUMNNOTFOUNDThe input column lineage ID "%1" referenced by property "%2" on output column "%3" could not be located in the input column collection.
Public fieldStatic memberDTS_E_INPUTCOLUMNUSAGETYPENOTREADONLYThe input column "%1" must be read-only. The input column has a usage type other than read-only, which is not allowed.
Public fieldStatic memberDTS_E_INPUTMUSTBESORTEDThe input is not sorted. The "%1" must be sorted.
Public fieldStatic memberDTS_E_INPUTNOTKNOWNThread "%1" received a buffer for input %2!d!, but this thread is not responsible for that input. An error occurred, causing the Data Flow engine scheduler to build a bad execution plan.
Public fieldStatic memberDTS_E_INPUTSNOTREADONLYThe Usage Type specified for the input columns to this transform cannot be read/write. Change the Usage Type to be read-only.
Public fieldStatic memberDTS_E_INPUTWITHOUTPATHSA required input object is not connected to a path object.
Public fieldStatic memberDTS_E_INSERTERCANTREADReading from the file "%1" failed with error code 0x%2!8.8X!.
Public fieldStatic memberDTS_E_INSERTERCOLUMNALREADYREFERENCEDThe %1 references the output column with ID %2!d!, but that column is already referenced by %3.
Public fieldStatic memberDTS_E_INSERTERCOLUMNNOTREFERENCEDThe "%1" is not referenced by any input column. Each output column must be referenced by exactly one input column.
Public fieldStatic memberDTS_E_INSERTERDATACOLUMNNOTBLOBThe "%1" references "%2", and that column is not the correct type. It must be DT_TEXT, DT_NTEXT, or DT_IMAGE. A reference points to a column that must be a BLOB.
Public fieldStatic memberDTS_E_INSERTEREXPECTBOMINVALIDTYPEThe "%1" has the ExpectBOM property set to TRUE for %2, but the column is not NT_NTEXT. The ExpectBOM specifies that the Import Column transformation expects a byte-order mark (BOM). Either set the ExpectBOM property to false or change the output column data type to DT_NTEXT.
Public fieldStatic memberDTS_E_INSERTERFILENAMECOLUMNNOTSTRINGThe "%1" should contain a file name, but it is not a String type.
Public fieldStatic memberDTS_E_INSERTERINVALIDBOMThe byte order mark (BOM) value for the file "%1" is 0x%2!4.4X!, but the expected value is 0x%3!4.4X!. The ExpectBOM property was set for this file, but the BOM value in the file is missing or not valid.
Public fieldStatic memberDTS_E_INSERTERINVALIDCOLUMNDATATYPEThe %1 has an unsupported datatype. It must be DT_STR or DT_WSTR.
Public fieldStatic memberDTS_E_INSERTERINVALIDDATACOLUMNSETTYPEData output columns must be DT_TEXT, DT_NTEXT, or DT_IMAGE. The data output column may only be set to a BLOB type.
Public fieldStatic memberDTS_E_INSERTERREFERENCEDCOLUMNNOTFOUNDThe "%1" references output column ID %2!d!, and that column is not found on the output.
Public fieldStatic memberDTS_E_INVALIDARRAYVALUEError getting or setting an array value. The type "%1" is not allowed. This occurs when loading an array into a variable.
Public fieldStatic memberDTS_E_INVALIDBUFFERTYPEThe buffer type is not valid. Make sure the Pipeline layout and all components pass validation.
Public fieldStatic memberDTS_E_INVALIDBULKINSERTFIRSTROWLASTROWVALUESThe value for the property %1 is %2!d!, which must be less than or equal to the value of %3!d! for property %4.
Public fieldStatic memberDTS_E_INVALIDBULKINSERTPROPERTYVALUEThe value for the property %1 is %2!d!, which is not allowed. The value must be greater than or equal to %3!d!.
Public fieldStatic memberDTS_E_INVALIDCACHEFILENAMEThe cache file name is either not provided or is not valid. Provide a valid cache file name.
Public fieldStatic memberDTS_E_INVALIDCERTHASHFORMATThe hash value is not a one-dimensional array of bytes (error: %1). This occurs in CPackage::LoadUserCertificateByHash.
Public fieldStatic memberDTS_E_INVALIDCHECKPOINT_TRANSACTIONThe current package settings are not supported. Please change the SaveCheckpoints property or the TransactionOption property.
Public fieldStatic memberDTS_E_INVALIDCHUNKSIZEThe chunk size is not valid. The ChunkSize property should be in the range of %1!d! to %2!d! (in KB).
Public fieldStatic memberDTS_E_INVALIDCODEPAGEThe code page %1!d! specified on output column "%2" (%3!d!) is not valid. Select a different code page for output column "%2".
Public fieldStatic memberDTS_E_INVALIDCOMPARISONFLAGSThe %1 has a ComparisonFlags property that includes extra flags with the value %2!d!.
Public fieldStatic memberDTS_E_INVALIDCOMPONENTFILENAMECannot get the file name for the component with a CLSID of "%1". Verify that the component is registered properly or that the CLSID provided is correct.
Public fieldStatic memberDTS_E_INVALIDCOMPONENTIDThe ID for a layout component is not valid.
Public fieldStatic memberDTS_E_INVALIDCUSTOMPROPERTYNAMEA custom property named "%1" is invalid because there is a stock property with that name. A custom property cannot have the same name as a stock property on the same object.
Public fieldStatic memberDTS_E_INVALIDDATABASEOBJECTNAMEDatabase object name "%1" is not valid.
Public fieldStatic memberDTS_E_INVALIDDATATYPEThe %1 had an invalid datatype value (%2!ld!) set.
Public fieldStatic memberDTS_E_INVALIDDATATYPEFORERRORCOLUMNSThe "%1" contains an invalid data type. "%1 " is a special error column, and the only valid data type is DT_I4.
Public fieldStatic memberDTS_E_INVALIDENUMERATORINDEXThe enumerator failed to retrieve element at index "%1!d!".
Public fieldStatic memberDTS_E_INVALIDERRORDISPOSITIONThe %1 has an invalid error or truncation row disposition.
Public fieldStatic memberDTS_E_INVALIDEXCLUSIONGROUPThe "%1" and the "%2" are in the same exclusion group, but they do not have the same synchronous input.
Public fieldStatic memberDTS_E_INVALIDFILEThe file specified in the For Each File enumerator is not valid. Check that the file specified in the For Each File enumerator exists.
Public fieldStatic memberDTS_E_INVALIDFILENAMEINCONNECTIONThe file name "%1" specified in the connection was not valid.
Public fieldStatic memberDTS_E_INVALIDFLATFILECOLUMNTYPEThe column type for column "%1" is incorrect. It is type "%2". It can only be either "%3" or "%4".
Public fieldStatic memberDTS_E_INVALIDFOREACHPROPERTYMAPPINGAn invalid property mapping is found on the For Each Loop. This occurs when the ForEach property mapping fails to restore.
Public fieldStatic memberDTS_E_INVALIDINDEXThe index is not valid.
Public fieldStatic memberDTS_E_INVALIDINPUTCOLUMNCACHEThe input column cache is invalid.
Public fieldStatic memberDTS_E_INVALIDINPUTCOUNTA component has an invalid number of inputs.
Public fieldStatic memberDTS_E_INVALIDINPUTLINEAGEID%1 has lineage ID %2!d! that was not previously used in the Data Flow task.
Public fieldStatic memberDTS_E_INVALIDNODENode "%1" is not a valid node. This happens when saving fails.
Public fieldStatic memberDTS_E_INVALIDOBJECTIDThe ID for the layout object is not valid.
Public fieldStatic memberDTS_E_INVALIDOBJECTNAMESSIS object name is invalid. More specific errors would have been raised explaining the exact naming problem.
Public fieldStatic memberDTS_E_INVALIDORDERCLAUSEOrder clause is not valid.
Public fieldStatic memberDTS_E_INVALIDOUTPUTCOUNTA component has an invalid number of outputs.
Public fieldStatic memberDTS_E_INVALIDOUTPUTEXCLUSIONGROUPThe %1 must be in exclusion group %2!d!. All outputs must be in the specified exclusion group.
Public fieldStatic memberDTS_E_INVALIDOUTPUTLINEAGEID%1 has lineage ID %2!d!, but should have had %3!d!.
Public fieldStatic memberDTS_E_INVALIDPARAMETERVALUEThe parameter value is invalid.
Public fieldStatic memberDTS_E_INVALIDPARAMETERVALUETYPEThe parameter value type is invalid.
Public fieldStatic memberDTS_E_INVALIDPARENTPACKAGEPATHGetPackagePath was called on the ForEachEnumerator but there was no ForEachLoop package path specified.
Public fieldStatic memberDTS_E_INVALIDPATHTOPACKAGEThe specified package path does not contain a package name. This occurs when the path does not contain at least one backslash or one forward slash.
Public fieldStatic memberDTS_E_INVALIDPRECISIONThe "%1" has a precision that is not valid. The precision must be between %2!ld! and %3!ld!.
Public fieldStatic memberDTS_E_INVALIDPROPERTYMAPPINGThe property mapping is not valid. The mapping is ignored.
Public fieldStatic memberDTS_E_INVALIDPROPERTYMAPPINGSFOUNDThe package failed to restore at least one property mapping.
Public fieldStatic memberDTS_E_INVALIDSCALEThe "%1" has a scale that is not valid. The scale must be between %2!ld! and %3!ld!.
Public fieldStatic memberDTS_E_INVALIDSCHEMEThe URL %1 is not valid. This can happen when a scheme other than http or https is specified, or the URL is in an incorrect format. A valid URL format is in the form of http://ServerName:Port/ResourcePath or https://ServerName:Port/ResourcePath.
Public fieldStatic memberDTS_E_INVALIDSERVERNAMEThe server name specified in the URL %1 cannot be resolved.
Public fieldStatic memberDTS_E_INVALIDSIGNATUREThe digital signature is not valid. The contents of the package have been modified.
Public fieldStatic memberDTS_E_INVALIDSSISSERVERNAMEInvalid server name "%1". SSIS service does not support multi-instance, use just server name instead of "server name\instance".
Public fieldStatic memberDTS_E_INVALIDSTRINGInvalid characters in string: "%1". This occurs when a string supplied for a property value contains unprintable characters.
Public fieldStatic memberDTS_E_INVALIDSTRINGLENGTHThe "%1" has a length that is not valid. The length must be between %2!ld! and %3!ld!.
Public fieldStatic memberDTS_E_INVALIDSYNCHRONOUSINPUT%1 has an invalid synchronous input ID %2!d!.
Public fieldStatic memberDTS_E_INVALIDTASKMONIKERCannot create a task with the name "%1". Verify that the name is correct.
Public fieldStatic memberDTS_E_INVALIDTASKMONIKERNOPARAMCannot create a task from XML. This occurs when the runtime is unable to resolve the name to create a task. Verify that the name is correct.
Public fieldStatic memberDTS_E_INVALIDTASKPOINTERThe wrappers task pointer is not valid. The wrapper has an invalid pointer to a task.
Public fieldStatic memberDTS_E_INVALIDTIMEOUTTimeout value is not valid. Timeout should be in the range of %1!d! to %2!d! (in seconds).
Public fieldStatic memberDTS_E_INVALIDURLThe URL specified is not valid. This can happen when the server or proxy URL is null, or in an incorrect format. A valid URL format is in the form of http://ServerName:Port/ResourcePath or https://ServerName:Port/ResourcePath.
Public fieldStatic memberDTS_E_INVALIDUSAGETYPEFORCUSTOMPROPERTYThe %1 must be read/write to have custom property "%2". The input or output column has the specified custom property, but is not read/write. Remove the property, or make the column read/write.
Public fieldStatic memberDTS_E_INVALIDUSESDISPOSITIONSVALUEThe UsesDispositions property cannot be changed from its initial value. This occurs when the XML is edited and the UsesDispositions value is modified. This value is set by the component when it is added to the package and is not allowed to change.
Public fieldStatic memberDTS_E_INVALIDVALUEINARRAYInvalid value in array.
Public fieldStatic memberDTS_E_INVALIDVARIABLEVALUEThe variable value assignment is not valid. This error happens when the client or a task assigns a runtime object to a variable value.
Public fieldStatic memberDTS_E_INVALIDVARVALUEAssigning invalid value or object to variable "%1". This error happens when a value is not appropriate for variables.
Public fieldStatic memberDTS_E_INVALIDVERNUMCANTBENEGATIVEThe version number in the package is not valid. The version number is negative.
Public fieldStatic memberDTS_E_INVALIDVERSIONNUMBERThe version number in the package is not valid. The version number cannot be greater than current version number.
Public fieldStatic memberDTS_E_INVALIDWRAPPEDOBJECTAn error occurred while accessing an internal object. This could indicate a custom extension built for Integration Services 2005 is being used.
Public fieldStatic memberDTS_E_JAGGEDEVENTINFOThe lengths of parameter names, types, and descriptions arrays are not equal. The lengths must be equal. This occurs when the lengths of the arrays are mismatched. There should be one entry per parameter in each array.
Public fieldStatic memberDTS_E_JOBSTASK_EMPTYSOURCELISTThere are no Jobs to transfer.
Public fieldStatic memberDTS_E_JOBSTASK_FAILEDTOTRANSFERJOBSFailed to transfer the Job(s).
Public fieldStatic memberDTS_E_JOBSTASK_JOBCANTBEFOUNDThe job "%1" cannot be found at source server.
Public fieldStatic memberDTS_E_JOBSTASK_JOBEXISTSATDESTThe job "%1" already exists at destination server.
Public fieldStatic memberDTS_E_JOINTYPEDOESNTMATCHETIThe JoinType property specified for input column '%1' differs from the JoinType specified for the corresponding reference table column when the Match Index was initially created. Either rebuild the Match Index with the given JoinType or change the JoinType to match the type used when the Match Index was created.
Public fieldStatic memberDTS_E_LAYOUTCANTSETUSAGETYPEAt input "%1" (%2!d!), the virtual input column collection does not contain a virtual input column with lineage ID %3!d!.
Public fieldStatic memberDTS_E_LOAD_PERSTFORMATFailed to load Data Flow objects. The specified format is not supported.
Public fieldStatic memberDTS_E_LOADCHECKPOINTThe package failed during execution because the checkpoint file cannot be loaded. Further execution of the package requires a checkpoint file. This error usually occurs when the CheckpointUsage property is set to ALWAYS, which specifies that the package always restarts.
Public fieldStatic memberDTS_E_LOADFROMSQLSERVERLoadFromSQLServer method has failed.
Public fieldStatic memberDTS_E_LOADFROMSQLSERVER_OLEDBThe LoadFromSQLServer method has encountered OLE DB error code 0x%1!8.8X! (%2). The SQL statement that was issued has failed.
Public fieldStatic memberDTS_E_LOADFROMXMLError loading from XML. No further detailed error information can be specified for this problem because no Events object was passed where detailed error information can be stored.
Public fieldStatic memberDTS_E_LOADPACKAGEXMLFailed to load XML due to error 0x%1!8.8X! "%2". This happens when loading a package and the file cannot be opened or loaded correctly into XML document. This can be the result of either providing an incorrect file name to the LoadPackage method or the XML file specified having an incorrect format.
Public fieldStatic memberDTS_E_LOADPACKAGEXMLFILEFailed to load XML from package file "%1" due to error 0x%2!8.8X! "%3". This happens when loading a package and the file cannot be opened or loaded correctly into an XML document. This can be the result of either providing an incorrect file name to the LoadPackage method or the XML file specified having an incorrect format.
Public fieldStatic memberDTS_E_LOADWININETThe FTP connection manager needs the following DLL to function: %1.
Public fieldStatic memberDTS_E_LOBDATATYPENOTSUPPORTEDThe "%1" has a long object data type of DT_TEXT, DT_NTEXT, or DT_IMAGE, which is not supported.
Public fieldStatic memberDTS_E_LOBLENGTHLIMITEXCEEDEDThe system stopped the processing of the character or binary large object (BLOB) data because the 4-GB limit for data size was reached.
Public fieldStatic memberDTS_E_LOCALEIDNOTSETThe component locale ID has not been set. Flat file adapters need to have the locale ID on the flat file connection manager set.
Public fieldStatic memberDTS_E_LOCALENOTINSTALLEDThe LocaleID %1!ld! is not installed on this system.
Public fieldStatic memberDTS_E_LOCKVARIABLEFORREADFailed to lock variable "%1" for read access with error 0x%2!8.8X! "%3".
Public fieldStatic memberDTS_E_LOCKVARIABLEFORWRITEFailed to lock variable "%1" for read/write access with error 0x%2!8.8X! "%3".
Public fieldStatic memberDTS_E_LOGFAILEDThe SSIS logging infrastructure failed with error code 0x%1!8.8X!. This error indicates that this logging error is not attributable to a specific log provider.
Public fieldStatic memberDTS_E_LOGINFAILUREThe login attempt failed for "%1". This error occurs when the login credentials provided are incorrect. Verify the login credentials.
Public fieldStatic memberDTS_E_LOGINSTASK_CANTGETLOGINSNAMELISTCannot get the list of "Logins" from source server.
Public fieldStatic memberDTS_E_LOGINSTASK_EMPTYDATABASELISTThe databases list is empty.
Public fieldStatic memberDTS_E_LOGINSTASK_EMPTYLISTThe list of "Logins" to transfer is empty.
Public fieldStatic memberDTS_E_LOGINSTASK_ERRORLOGINEXISTSLogin "%1" already exists at destination server.
Public fieldStatic memberDTS_E_LOGINSTASK_FAILEDTOTRANSFERLOGINSFailed to transfer some or all of the logins.
Public fieldStatic memberDTS_E_LOGINSTASK_LOGINNOTFOUNDLogin "%1" does not exist at source.
Public fieldStatic memberDTS_E_LOGPROVIDERFAILEDThe SSIS logging provider "%1" failed with error code 0x%2!8.8X! (%3). This indicates a logging error attributable to the specified log provider.
Public fieldStatic memberDTS_E_LOGPROVIDERVALIDATIONFAILEDValidation of one or more log providers failed. The package cannot execute. The package does not execute when a log provider fails validation.
Public fieldStatic memberDTS_E_LOOKUPEMPTYSQLCOMMANDThe SQL command has a result of empty lookup.
Public fieldStatic memberDTS_E_MANAGEDCOMPONENTSTORENOTFOUNDUnable to find the directories containing Tasks and Data Flow Task components. Check the integrity of your installation.
Public fieldStatic memberDTS_E_MANAGEDERR_BADFORMATSPECIFICATIONThe message string being posted by the managed error infrastructure contains a bad format specification. This is an internal error.
Public fieldStatic memberDTS_E_MANAGEDERR_UNSUPPORTEDTYPEWhile formatting a message string using the managed error infrastructure, there was a variant type that does not have formatting support. This is an internal error.
Public fieldStatic memberDTS_E_MAPPINGSETUPERRORThere was an error setting up the mapping. %1
Public fieldStatic memberDTS_E_MCASTOUTPUTCOLUMNSOutput "%1" (%2!d!) has output columns, but multicast outputs do not declare columns. The package is damaged.
Public fieldStatic memberDTS_E_MERGEJOINSORTEDOUTPUTHASNOSORTKEYPOSITIONSThe "%1" has IsSorted set to TRUE, but the SortKeyPosition on all output columns are zero. Either change the IsSorted to FALSE, or select at least one output column to contain a non-zero SortKeyPosition.
Public fieldStatic memberDTS_E_METADATACOLLECTIONNOTUSEDThe external metadata collection on "%1" is marked as not used, so no operations can be performed on it.
Public fieldStatic memberDTS_E_METADATAMISMATCHWITHINPUTCOLUMNThe "%1" metadata does not match the metadata of the input column.
Public fieldStatic memberDTS_E_METADATAMISMATCHWITHOUTPUTCOLUMNThe metadata for "%1" does not match the metadata for the associated output column.
Public fieldStatic memberDTS_E_METADATAREADONLYMetadata cannot be changed during execution.
Public fieldStatic memberDTS_E_MGDSRC_ERRORThe value was an error.
Public fieldStatic memberDTS_E_MGDSRC_OVERFLOWThe value was too large to fit in the %1.
Public fieldStatic memberDTS_E_MGDSRCSTATIC_OVERFLOWThe value was too large to fit in the column.
Public fieldStatic memberDTS_E_MISMATCHCOMPONENTCONNECTIONMANAGERLOCALEIDMismatched locale IDs. The component locale ID (%1!d!) does not match the connection manager locale ID (%2!d!).
Public fieldStatic memberDTS_E_MISMATCHCONNECTIONMANAGERCOLUMNThe column "%1" at index %2!d! in the flat file connection manager was not found at index %3!d! in the column collection of the flat file adapter.
Public fieldStatic memberDTS_E_MISMATCHPARAMETERVALUEThe parameter value was mismatched.
Public fieldStatic memberDTS_E_MISSINGCUSTOMPROPERTYThe "%1" is missing the required property "%2". The object is required to have the specified custom property.
Public fieldStatic memberDTS_E_MISSINGOBJECTDATAThe ObjectData element is missing in the XML block of a hosted object. This occurs when the XML parser attempts to locate the data element for an object and it cannot be found.
Public fieldStatic memberDTS_E_MISSINGSQLCOMMANDThe SQL command has not been set correctly. Check SQLCommand property.
Public fieldStatic memberDTS_E_MORETHANONEERROROUTPUTFOUNDMore than one error output was found on the component, and there can be only one.
Public fieldStatic memberDTS_E_MSGQTASKUTIL_CERT_FAILED_GETTING_DISPLAY_NAMEAn error occurred while retrieving the display name of the certificate.
Public fieldStatic memberDTS_E_MSGQTASKUTIL_CERT_FAILED_GETTING_FRIENDLY_NAMEAn error occurred while retrieving the friendly name of the certificate.
Public fieldStatic memberDTS_E_MSGQTASKUTIL_CERT_FAILED_GETTING_ISSUER_NAMEAn error occurred while retrieving the issuer name of the certificate.
Public fieldStatic memberDTS_E_MSGQTASKUTIL_CERT_OPEN_STORE_FAILEDOpening the certificate store failed.
Public fieldStatic memberDTS_E_MSMQTASK_CONNECTIONTYPENOTMSMQConnection "%1" is not of type MSMQ.
Public fieldStatic memberDTS_E_MSMQTASK_CONNMNGRDOESNOTEXISTThe connection manager "%1" does not exist.
Public fieldStatic memberDTS_E_MSMQTASK_CONNMNGRNULLThe connection manager "%1" is empty.
Public fieldStatic memberDTS_E_MSMQTASK_DATA_FILE_NAME_EMPTYData file name is empty.
Public fieldStatic memberDTS_E_MSMQTASK_DATA_FILE_SAVE_FAILEDSaving the data file failed.
Public fieldStatic memberDTS_E_MSMQTASK_DATA_FILE_SAVE_NAME_EMPTYThe name specified for the data file to save is empty.
Public fieldStatic memberDTS_E_MSMQTASK_DATA_FILE_SIZE_ERRORFile size should be less than 4 MB.
Public fieldStatic memberDTS_E_MSMQTASK_DATAFILE_ALREADY_EXISTSThe data file "%1" already exists at the specified location. Cannot overwrite the file as the Overwrite option is set to false.
Public fieldStatic memberDTS_E_MSMQTASK_FIPS1402COMPLIANCEThe operation requested is not allowed in systems compliant with U.S. FIPS 140-2.
Public fieldStatic memberDTS_E_MSMQTASK_INITIALIZATION_WITH_WRONG_XML_ELEMENTTask was initialized with the wrong XML element.
Public fieldStatic memberDTS_E_MSMQTASK_INVALID_ENCRYPTION_ALGO_WRAPPERYou are trying to set the value of Encryption Algorithm with an invalid object.
Public fieldStatic memberDTS_E_MSMQTASK_INVALID_MESSAGE_TYPEThe message type is not valid.
Public fieldStatic memberDTS_E_MSMQTASK_INVALID_PROPERTY_VALUEThe property specified is not valid. Verify that the argument type is correct.
Public fieldStatic memberDTS_E_MSMQTASK_INVALID_QUEUE_PATHQueue path is not valid.
Public fieldStatic memberDTS_E_MSMQTASK_MESSAGE_NON_AUTHENTICATEDMessage is not authenticated.
Public fieldStatic memberDTS_E_MSMQTASK_NO_CONNECTIONThe MSMQ connection name is not set.
Public fieldStatic memberDTS_E_MSMQTASK_NOT_TRANSACTIONALThe message queue task does not support enlisting in distributed transactions.
Public fieldStatic memberDTS_E_MSMQTASK_RECEIVE_VARIABLE_EMPTYVariable to receive variable message is empty.
Public fieldStatic memberDTS_E_MSMQTASK_STRING_COMPARE_VALUE_MISSINGString filter value is empty.
Public fieldStatic memberDTS_E_MSMQTASK_STRING_MSG_TO_VARIABLE_NOT_FOUNDThe specified variable "%1" to receive string message is not found in the package variable collection.
Public fieldStatic memberDTS_E_MSMQTASK_TASK_TIMEOUTThe message queue timed out. No message has been received.
Public fieldStatic memberDTS_E_MSMQTASK_VARIABLE_TO_RECEIVE_STRING_MSG_EMPTYThe variable to receive string message is empty.
Public fieldStatic memberDTS_E_MULTICACHECOLMAPPINGSThe cache column, "__", is mapped to more than one column. Remove the duplicate column mappings.
Public fieldStatic memberDTS_E_MULTIPLECACHEWRITESThe __ cannot write to the cache because __ has already written to it.
Public fieldStatic memberDTS_E_MULTIPLEFILESONRETAINEDCONNECTIONMultiple file names cannot be specified on a connection when the Retain property is TRUE. Vertical bars were found on the connection string, meaning multiple file names are being specified and, in addition, the Retain property is TRUE.
Public fieldStatic memberDTS_E_MULTIPLYMAPPEDOUTCOLThe %1 is mapped to an output column that already has a mapping on this input.
Public fieldStatic memberDTS_E_MUTEXOWNBYDIFFUSERMutex "__" already exists and is owned by another user.
Public fieldStatic memberDTS_E_NAMEALREADYADDEDThe object cannot be added because another object with the same name already exists in the collection. Use a different name to resolve this error.
Public fieldStatic memberDTS_E_NAMEALREADYEXISTSThe object name cannot be changed from "%1" to "%2" because another object in the collection already uses that name. Use a different name to resolve this error.
Public fieldStatic memberDTS_E_NEGATIVEINDEXNOTALLOWEDIndexes cannot be negative. This error occurs when a negative value is used as an index to a collection.
Public fieldStatic memberDTS_E_NEGATIVESNOTALLOWEDThe %1 can't be assigned a negative value.
Public fieldStatic memberDTS_E_NEGATIVEVALUESNOTALLOWEDThis property cannot be assigned a negative value. This error occurs when a negative value is assigned to a property that can only contain positive values, such as the COUNT property.
Public fieldStatic memberDTS_E_NEGATIVEVERSIONThe version number cannot be negative. This error occurs when the VersionMajor, VersionMinor, or VersionBuild property of the package is set to a negative value.
Public fieldStatic memberDTS_E_NOBUFFERTYPEONSYNCOUTPUTThe %1 is a synchronous output and the buffer type cannot be retrieved for a synchronous output.
Public fieldStatic memberDTS_E_NOCANCELEVENTThe runtime cannot provide a cancel event because of error 0x%1!8.8X!.
Public fieldStatic memberDTS_E_NOCOLUMNADVANCETHROUGHFILENo column was specified to allow the component to advance through the file.
Public fieldStatic memberDTS_E_NOCOMPONENTATTACHEDThe %1 is not attached to a component. It is required that a component be attached.
Public fieldStatic memberDTS_E_NOCONTAININGTYPELIBUnable to retrieve the type library of the object. This error occurs when the Properties collection attempts to retrieve the type library for an object through its IDispatch interface.
Public fieldStatic memberDTS_E_NOCUSTOMPROPCOLFailed to get custom property collection for Data Flow components.
Public fieldStatic memberDTS_E_NODATATABLEMATCHROWIDThe %1 contains a RowsetID with a value of %2 that does not reference a data table in the schema.
Public fieldStatic memberDTS_E_NODELISTENUM_INVALIDCONNMGRTYPEConnection manager "%1" is not of type "%2".
Public fieldStatic memberDTS_E_NODELISTENUM_INVALIDDATANODEInvalid data node in the node list enumerator section.
Public fieldStatic memberDTS_E_NODELISTENUM_NOENUMERATORCREATEDNo enumerator can be created.
Public fieldStatic memberDTS_E_NODELISTENUM_XPATHISEMPTY"%1" is empty.
Public fieldStatic memberDTS_E_NODENOTFOUNDNode cannot be found in custom default persistence. This error occurs if the default saved XML of an extensible object was changed in a way that a saved object is no longer found, or if the extensible object itself changed.
Public fieldStatic memberDTS_E_NODISPATCHThe object does not implement IDispatch. This error occurs when a property object or properties collection attempts to access an IDispatch interface on an object.
Public fieldStatic memberDTS_E_NOERRORDESCFORCOMPONENTThe component does not supply error code descriptions.
Public fieldStatic memberDTS_E_NOEVALEXPRESSIONThe evaluation condition expression on the For Loop "%1" is empty. There must be a Boolean evaluation expression in the For Loop.
Public fieldStatic memberDTS_E_NOINPUTSOROUTPUTSA component does not have any inputs or outputs.
Public fieldStatic memberDTS_E_NOKEYCOLSNo key columns are found. The %1 must have at least one column with a SortKeyPosition that is non-zero.
Public fieldStatic memberDTS_E_NOMOREBUFFERTYPESThe buffer manager ran out of memory while trying to extend the table of buffer types. This is caused by an out-of-memory condition.
Public fieldStatic memberDTS_E_NOMOREIDSThe maximum ID has been reached. There are no more IDs available to assign to objects.
Public fieldStatic memberDTS_E_NONSORTEDOUTPUTHASSORTKEYPOSITIONSThe IsSorted property for "%1" is false, but %2!lu! of its output columns' SortKeyPositions are non-zero.
Public fieldStatic memberDTS_E_NONSTRINGCOMPARISONFLAGSNOTZEROThe comparison flags for "%1" must be zero because its type is not a string type. ComparisonFlags can only be non-zero for string type columns.
Public fieldStatic memberDTS_E_NOOUTPUTCOLUMNFORINPUTCOLUMNThere is no output column associated with input column "%1" (%2!d!).
Public fieldStatic memberDTS_E_NOOUTPUTCOLUMNS"%1" contains no output columns. An asynchronous output must contain output columns.
Public fieldStatic memberDTS_E_NOROWSETRETURNEDNo result row set is associated with the execution of this query. The result is not correctly specified.
Public fieldStatic memberDTS_E_NOSCHEMAINFOFOUNDNo column information was returned by the SQL command.
Public fieldStatic memberDTS_E_NOSQLPROFILERDLLThe log provider for SQL Server Profiler was unable to load pfclnt90.dll. Please check that SQL Server Profiler is installed.
Public fieldStatic memberDTS_E_NOTDISPENSEDThe Variables collection has not been returned from the VariableDispenser. An operation was attempted that is only allowed on dispensed collections.
Public fieldStatic memberDTS_E_NOTENOUGHPARAMETERSPROVIDEDThe SQL command requires %1!d! parameters, but the parameter mapping only has %2!d! parameters.
Public fieldStatic memberDTS_E_NOTEXECUTINGSuspend or Resume call failed because the executable is not executing, or is not the top-level executable. This occurs when the client calls Suspend or Resume on an executable that is not currently processing an Execute call.
Public fieldStatic memberDTS_E_NOTINITIALIZEDAn internal object or variable was not initialized. This is an internal product error. This error is returned when a variable should have a valid value but does not.
Public fieldStatic memberDTS_E_NOTSUSPENDEDResume call failed because the package is not suspended. This occurs when the client calls resume, but the package is not suspended.
Public fieldStatic memberDTS_E_NTEXTDATATYPENOTSUPPORTEDWITHANSIFILESThe data type for "%1" is DT_NTEXT, which is not supported with ANSI files. Use DT_TEXT instead and convert the data to DT_NTEXT using the data conversion component.
Public fieldStatic memberDTS_E_OBJECTIDLOOKUPFAILEDUnable to locate an object with ID %1!d! because of the error code 0x%2!8.8X!.
Public fieldStatic memberDTS_E_OBJECTIDNOTFOUNDNo object exists with the ID %1!d!.
Public fieldStatic memberDTS_E_OBJECTLINEAGEIDNOTFOUNDNo object exists with a lineage ID of %1!d!.
Public fieldStatic memberDTS_E_OBJECTNOTINFOREACHLOOPFailure when adding an object to a ForEachPropertyMapping that is not a direct child of the ForEachLoop container.
Public fieldStatic memberDTS_E_OBJECTNOTINHASHTABLEThe object is not in the hash table.
Public fieldStatic memberDTS_E_ODBCERRORAn ODBC error %1!d! has occurred.
Public fieldStatic memberDTS_E_ODBCERRORCONNECTThere was an error trying to establish an Open Database Connectivity (ODBC) connection with the database server.
Public fieldStatic memberDTS_E_ODBCERRORDBCThere was an error creating an Open Database Connectivity (ODBC) database connection.
Public fieldStatic memberDTS_E_ODBCERRORENVThere was an error creating an Open Database Connectivity (ODBC) environment.
Public fieldStatic memberDTS_E_ODBCTRANSACTIONENLISTThere was an error trying to enlist an ODBC connection in a transaction. The SQLSetConnectAttr failed to set the SQL_ATTR_ENLIST_IN_DTC attribute.
Public fieldStatic memberDTS_E_OLEDB_ACENOTFOUNDThe ace was not found or not installed.
Public fieldStatic memberDTS_E_OLEDB_CREATEACCESSORFailed to create an OLE DB accessor.
Public fieldStatic memberDTS_E_OLEDB_CREATEACCESSOR_UNSUPPORTEDCONVERSIONThe conversion is not supported in creating an OLE DB accessor.
Public fieldStatic memberDTS_E_OLEDB_EXCEL_NOT_SUPPORTEDSSIS Error Code DTS_E_OLEDB_EXCEL_NOT_SUPPORTED: The Excel Connection Manager is not supported in the 64-bit version of SSIS, as no OLE DB provider is available.
Public fieldStatic memberDTS_E_OLEDB_NOPROVIDER_64BIT_ERRORSSIS Error Code DTS_E_OLEDB_NOPROVIDER_64BIT_ERROR: The requested OLE DB provider is not registered -- perhaps no 64-bit provider is available. Error code: __.
Public fieldStatic memberDTS_E_OLEDB_NOPROVIDER_ERRORSSIS Error Code DTS_E_OLEDB_NOPROVIDER_ERROR: The requested OLE DB provider is not registered. Error code: __.
Public fieldStatic memberDTS_E_OLEDB_OLDPROVIDER_ERRORConsider changing the PROVIDER in the connection string to %1 or visit http://www.microsoft.com/downloads to find and install support for %2.
Public fieldStatic memberDTS_E_OLEDBDESTINATIONADAPTERSTATIC_CANTCONVERTVALUEThe data value cannot be converted for reasons other than sign mismatch or data overflow.
Public fieldStatic memberDTS_E_OLEDBDESTINATIONADAPTERSTATIC_DATAOVERFLOWConversion failed because the data value overflowed the type used by the provider.
Public fieldStatic memberDTS_E_OLEDBDESTINATIONADAPTERSTATIC_INTEGRITYVIOLATIONThe data value violates integrity constraints.
Public fieldStatic memberDTS_E_OLEDBDESTINATIONADAPTERSTATIC_PERMISSIONDENIEDThe user did not have the correct permissions to write to the column.
Public fieldStatic memberDTS_E_OLEDBDESTINATIONADAPTERSTATIC_SCHEMAVIOLATIONThe data value violated the schema constraint.
Public fieldStatic memberDTS_E_OLEDBDESTINATIONADAPTERSTATIC_SIGNMISMATCHConversion failed because the data value was signed and the type used by the provider was unsigned.
Public fieldStatic memberDTS_E_OLEDBDESTINATIONADAPTERSTATIC_TRUNCATEDThe data was truncated.
Public fieldStatic memberDTS_E_OLEDBDESTINATIONADAPTERSTATIC_UNAVAILABLENo status is available.
Public fieldStatic memberDTS_E_OLEDBERRORSSIS Error Code DTS_E_OLEDBERROR: An OLE DB error has occurred. Error code: 0x%1!8.8X!.
Public fieldStatic memberDTS_E_OLEDBPROVIDERDATATYPECONVERSIONUNSUPPORTEDThe OLE DB provider used by the OLE DB adapter cannot convert between types "%1" and "%2" for "%3".
Public fieldStatic memberDTS_E_OLEDBRECORDAn OLE DB record is available. Source: "%1" Hresult: 0x%2!8.8X! Description: "%3".
Public fieldStatic memberDTS_E_OLEDBSOURCEADAPTERSTATIC_CANTCONVERTVALUEThe data value cannot be converted for reasons other than sign mismatch or data overflow.
Public fieldStatic memberDTS_E_OLEDBSOURCEADAPTERSTATIC_DATAOVERFLOWConversion failed because the data value overflowed the type used by the provider.
Public fieldStatic memberDTS_E_OLEDBSOURCEADAPTERSTATIC_SIGNMISMATCHConversion failed because the data value was signed and the type used by the provider was unsigned.
Public fieldStatic memberDTS_E_OLEDBSOURCEADAPTERSTATIC_TRUNCATEDThe data was truncated.
Public fieldStatic memberDTS_E_OLEDBSOURCEADAPTERSTATIC_UNAVAILABLENo status is available.
Public fieldStatic memberDTS_E_OLEDBTRANSACTIONENLISTThe SSIS Runtime has failed to enlist the OLE DB connection in a distributed transaction with error 0x%1!8.8X! "%2".
Public fieldStatic memberDTS_E_OPENCERTSTOREError opening certificate store.
Public fieldStatic memberDTS_E_OPENCHECKPOINTFILECheckpoint file "%1" failed to open due to error 0x%2!8.8X! "%3".
Public fieldStatic memberDTS_E_OPENFILEFailed to open package file. This happens when loading a package and the file cannot be opened or loaded correctly into an XML document. This can be the result of either providing an incorrect file name to the LoadPackage method or the XML file specified having an incorrect format.
Public fieldStatic memberDTS_E_OPENLOGFAILEDThe SSIS logging provider has failed to open the log. Error code: 0x%1!8.8X!.
Public fieldStatic memberDTS_E_OPENPACKAGEFILEFailed to open package file "%1" due to error 0x%2!8.8X! "%3". This happens when loading a package and the file cannot be opened or loaded correctly into the XML document. This can be the result of either providing an incorrect file name was specified when calling LoadPackage or the XML file was specified and has an incorrect format.
Public fieldStatic memberDTS_E_OPERATIONFAILCACHEINUSEThe operation failed because the cache is in use.
Public fieldStatic memberDTS_E_OUTPUTCOLUMNHASNOERRORCOLUMNThe %1 on the non-error output has no corresponding output column on the error output.
Public fieldStatic memberDTS_E_OUTPUTCOLUMNNAMECONFLICTColumn name "%1" on output "%2" cannot be used because it conflicts with a column of the same name on synchronous input "%3".
Public fieldStatic memberDTS_E_OUTPUTCOLUMNNOTININPUTOutput column "%1" (%2!d!) references input column with lineage ID %3!d!, but no input could be found with that lineage ID.
Public fieldStatic memberDTS_E_OUTPUTNOTUSEDThe output with ID __ of Aggregate component is not used by any component. Please either remove it or associate it with an input of some component.
Public fieldStatic memberDTS_E_OUTPUTREDIRECTINTRANSACTIONNOTALLOWEDThe %1 cannot be set to redirect on error using a connection in a transaction.
Public fieldStatic memberDTS_E_OUTPUTWITHMULTIPLEERRORSOutput ID %1!d! was given multiple error output configurations. First %2!d! and %3!d!, then %4!d! and %5!d!.
Public fieldStatic memberDTS_E_PACKAGE_OWNEDBYPROJECTThe package owned by the project.
Public fieldStatic memberDTS_E_PACKAGE_PASSWORD_INCONSISTENTThe package password was inconsistent.
Public fieldStatic memberDTS_E_PACKAGE_PROTECTIONLEVEL_INCONSISTENTThe protection level of the package was inconsistent.
Public fieldStatic memberDTS_E_PACKAGEDESCRIPTIONTOOLONGPackage description is too long. The limit is 1024 characters. Shorten the package description.
Public fieldStatic memberDTS_E_PACKAGELOADFAILEDThe package failed to load due to error 0x%1!8.8X! "%2". This occurs when CPackage::LoadFromXML fails.
Public fieldStatic memberDTS_E_PACKAGEMIGRATEDThe package has been migrated to a later version during loading. It must be reloaded to complete the process. This is an internal error code.
Public fieldStatic memberDTS_E_PACKAGEMIGRATIONFAILEDPackage migration from version %1!d! to version %2!d! failed with error 0x%3!8.8X! "%4".
Public fieldStatic memberDTS_E_PACKAGEMIGRATIONMODULEPackage migration module has failed.
Public fieldStatic memberDTS_E_PACKAGEMIGRATIONMODULELOADPackage migration module has failed to load.
Public fieldStatic memberDTS_E_PACKAGENAMETOOLONGPackage name is too long. The limit is 128 characters. Shorten the package name.
Public fieldStatic memberDTS_E_PACKAGENOTFOUNDThe specified package could not be loaded from the SQL Server database.
Public fieldStatic memberDTS_E_PACKAGEOBJECTNOTENVELOPEDFailed to find package object in signed XML envelope with error 0x%1!8.8X! "%2". This occurs when signed XML does not contain a SSIS package, as expected.
Public fieldStatic memberDTS_E_PACKAGEPASSWORDThe package is encrypted with a password. The password was not specified, or is not correct.
Public fieldStatic memberDTS_E_PACKAGEPASSWORDEMPTYThe protection level of the package requires a password, but PackagePassword property is empty.
Public fieldStatic memberDTS_E_PACKAGEPROTECTFailed to apply package protection with error 0x%1!8.8X! "%2". This error occurs when saving to Xml.
Public fieldStatic memberDTS_E_PACKAGEREMOVEFAILEDAn error was encountered when trying to remove the package "%1" from SQL Server.
Public fieldStatic memberDTS_E_PACKAGEUNPROTECTFailed to remove package protection with error 0x%1!8.8X! "%2". This occurs in the CPackage::LoadFromXML method.
Public fieldStatic memberDTS_E_PACKAGEUPDATEDISABLEDThe package has an older format version, but automatic package format upgrading is disabled.
Public fieldStatic memberDTS_E_PACKAGEUPGRADEFAILEDThe package upgrade has failed.
Public fieldStatic memberDTS_E_PACKAGEVERIFICATIONFAILEDThe cryptographic signature of the package failed verification due to error 0x%1!8.8X! "%2". This occurs when the signature verification operation fails.
Public fieldStatic memberDTS_E_PARAMETERNOTFOUNDINCOLLThe parameter is not found in the parameter collection.
Public fieldStatic memberDTS_E_PARAMETERNOTFOUNDINMAPPINGThe SQL command requires a parameter named "%1", which is not found in the parameter mapping.
Public fieldStatic memberDTS_E_PARAMETERVALUEUNAVAILABLEThe parameter value is not available.
Public fieldStatic memberDTS_E_PARAMETERVARIABLE_READONLYThe parameter variable is in read-only mode.
Public fieldStatic memberDTS_E_PATHUNKNOWNCannot retrieve path to object. This is a system error.
Public fieldStatic memberDTS_E_PERSISTENCEERRORError loading value "%1" from node "%2".
Public fieldStatic memberDTS_E_PIPELINE_LOADFailed to load Data Flow objects.
Public fieldStatic memberDTS_E_PIPELINE_SAVEFailed to save Data Flow objects.
Public fieldStatic memberDTS_E_PIPELINETOOCOMPLEXThe number of threads required for this pipeline is %1!d!, which is more than the system limit of %2!d!. The pipeline requires too many threads as configured. There are either too many asynchronous outputs, or EngineThreads property is set too high. Split the pipeline into multiple packages, or reduce the value of the EngineThreads property.
Public fieldStatic memberDTS_E_PMFAILALERTREMOVEFailure when alerting property mappings that a target is being removed.
Public fieldStatic memberDTS_E_PMINVALIDPROPMAPTARGETAttempted to set property mapping to target unsupported object type. This error occurs when passing an unsupported object type to a property mapping.
Public fieldStatic memberDTS_E_PMNODESTPROPERTYThe destination property for the property map is empty. Set the destination property name.
Public fieldStatic memberDTS_E_PMPROPERTYINVALIDA destination property was specified on a property mapping that is invalid. This occurs when a property is specified on a destination object that is not found on that object.
Public fieldStatic memberDTS_E_PMVARPROPTYPESDIFFERENTAn error occurred because there is a property mapping from a variable to a property with a different type. The property type must match the variable type.
Public fieldStatic memberDTS_E_PRECEDENCECONSTRAINTThere was an error in the precedence constraint between "%1" and "%2".
Public fieldStatic memberDTS_E_PREPARETREENODEFAILEDThe Data Flow task failed to prepare buffers for the execution tree node beginning at output "%1" (%2!d!).
Public fieldStatic memberDTS_E_PRIMEOUTPUTCALLEDWITHINVALIDOUTPUTIDPrimeOutput was called with an invalid output ID of %1!d!.
Public fieldStatic memberDTS_E_PRIMEOUTPUTFAILEDSSIS Error Code DTS_E_PRIMEOUTPUTFAILED: The PrimeOutput method on %1 returned error code 0x%2!8.8X!. The component returned a failure code when the pipeline engine called PrimeOutput(). The meaning of the failure code is defined by the component, but the error is fatal and the pipeline stopped executing. There may be error messages posted before this with more information about the failure.If you are using the SQL Server Agent to run the package, select Include Step Output in History in the New Job Step dialog box to obtain more information about the error that caused the PrimeOutput() method to fail.
Public fieldStatic memberDTS_E_PRIMEOUTPUTNOEORThe PrimeOutput method on "%1" returned success, but did not report an end of the row set. There is an error in the component. It should have reported an end-of-row. The pipeline will shut down execution to avoid unpredictable results.
Public fieldStatic memberDTS_E_PROBLEMDETECTINGTYPECOMPATIBILITYThe error code 0x%1!8.8X! was returned when validating type conversion from %2 to %3.
Public fieldStatic memberDTS_E_PROCESSINPUTCALLEDWITHINVALIDINPUTIDProcessInput was called with an invalid input ID of %1!d!.
Public fieldStatic memberDTS_E_PROCESSINPUTFAILEDSSIS Error Code DTS_E_PROCESSINPUTFAILED: The ProcessInput method on component "%1" (%2!d!) failed with error code 0x%3!8.8X!. The identified component returned an error from the ProcessInput method. The error is specific to the component, but the error is fatal and will cause the Data Flow task to stop running. There may be error messages posted before this with more information about the failure.
Public fieldStatic memberDTS_E_PRODUCTLEVELTOLOWSSIS Error Code DTS_E_PRODUCTLEVELTOLOW: The %1 cannot run on installed %2 of Integration Services. It requires %3 or higher.
Public fieldStatic memberDTS_E_PROJECTSAVEFAILED_INCONSISTENTThe error occurred in saving the project is not consistent.
Public fieldStatic memberDTS_E_PROPERTIESCOLLECTIONREADONLYProperties collection cannot be modified.
Public fieldStatic memberDTS_E_PROPERTYCANNOTBEMODIFIEDThe property cannot be modified.
Public fieldStatic memberDTS_E_PROPERTYEXPRESSIONEVALThe expression "%1" on property "%2" cannot be evaluated. Modify the expression to be valid.
Public fieldStatic memberDTS_E_PROPERTYEXPRESSIONSDISABLEDONVARIABLESThe Expression property is not supported on Variable objects. Use the EvaluateAsExpression property instead.
Public fieldStatic memberDTS_E_PROPERTYEXPRESSIONSETThe result of the expression "%1" on property "%2" cannot be written to the property. The expression was evaluated, but cannot be set on the property.
Public fieldStatic memberDTS_E_PROPERTYISEMPTYThe property "%1" is empty. The property cannot be empty.
Public fieldStatic memberDTS_E_PROPERTYNOTSUPPORTEDThe property "%1" cannot be set on "%2". The property being set is not supported on the specified object. Check the property name, case, and spelling.
Public fieldStatic memberDTS_E_PROPERTYREADONLYThe property "%1" is read only. This occurs when a change to a read-only property is attempted.
Public fieldStatic memberDTS_E_PROPERTYWRITEONLYThe property "%1" is write-only. This error occurs when trying to retrieve the value of a property through a property object, but the property is write-only.
Public fieldStatic memberDTS_E_PROPVALUEIGNOREDThe "%1" has a value set for length, precision, scale, or code page that is a value other than zero, but the data type requires the value to be zero.
Public fieldStatic memberDTS_E_PROXYAUTHProxy authentication failed. This error occurs when login credentials are not provided, or the credentials are incorrect.
Public fieldStatic memberDTS_E_QUEUEWORKITEMFAILEDThe Sort transformation cannot queue a work item to its thread pool. There is not enough memory available.
Public fieldStatic memberDTS_E_RAWBADHEADEREncountered bad metadata in file header. The file is damaged or not a SSIS-produced raw data file.
Public fieldStatic memberDTS_E_RAWBADVERSIONThe file had bad version and flags information. The file is damaged or not a SSIS-produced raw data file.
Public fieldStatic memberDTS_E_RAWBYTESTOOLONGThe binary field is too large. The adapter attempted to read a binary field that was %1!d! bytes long, but expected a field no longer than %2!d! bytes at offset %3!d!. This usually occurs when the input file is not valid. The file contains a string length that is too large for the buffer column.
Public fieldStatic memberDTS_E_RAWCANTAPPENDTRUNCATEError caused by conflicting property settings. Both the AllowAppend property and the ForceTruncate property are set to TRUE. Both properties cannot be set to TRUE. Set one of the two properties to FALSE.
Public fieldStatic memberDTS_E_RAWCANTREADCannot read %1!d! bytes from file "%2". The cause of the failure should have been previously reported.
Public fieldStatic memberDTS_E_RAWCANTWRITECannot write %1!d! bytes to file "%2". See previous error messages for details.
Public fieldStatic memberDTS_E_RAWDESTBLOBDATATYPEThe %1 has an invalid data type. Columns with data types DT_IMAGE, DT_TEXT and DT_NTEXT cannot be written to raw files.
Public fieldStatic memberDTS_E_RAWDESTMAPPEDINPUTCOLUMNThe %1 is mapped to an external metadata column with the id %2!d!. Input columns should not be mapped to external metadata columns when selected Write Option value is Create Always.
Public fieldStatic memberDTS_E_RAWDESTNOINPUTCOLUMNSThere is no selected column to be written to the file.
Public fieldStatic memberDTS_E_RAWDESTWRONGEXTERNALMETADATAUSAGEThe external metadata collection is improperly used by this component. The component should use external metadata when appending or truncating an existing file. Otherwise, the external metadata is not needed.
Public fieldStatic memberDTS_E_RAWEXISTSCREATEONCEError occurred because the output file already exists and the WriteOption is set to Create Once. Set the WriteOption property to Create Always, or delete the file.
Public fieldStatic memberDTS_E_RAWFILECANTBUFFERAn I/O buffer cannot be created for the output file. Error may occur when there are no file privileges or the disk is full.
Public fieldStatic memberDTS_E_RAWFILECANTOPENFile "%1" cannot be opened for writing. Error may occur when there are no file privileges or the disk is full.
Public fieldStatic memberDTS_E_RAWFILECANTOPENFORMETADATAThe file cannot be opened for reading the metadata. If the file does not exist, and the component has already defined external metadata, you can set the "ValidateExternalMetadata" property to "false" and the file will be created at the runtime.
Public fieldStatic memberDTS_E_RAWFILECANTOPENREADFile "%1" cannot be opened for reading. Error may occur when there are no privileges or the file is not found. Exact cause is reported in previous error message.
Public fieldStatic memberDTS_E_RAWFILENAMEINVALIDThe file name property is not valid. The file name is a device or contains invalid characters.
Public fieldStatic memberDTS_E_RAWFILENAMEREQUIREDThe file name is not properly specified. Supply the path and name to the raw file either directly in the FileName property or by specifying a variable in the FileNameVariable property.
Public fieldStatic memberDTS_E_RAWINVALIDACCESSMODEThe value %1!d! is not recognized as a valid access mode.
Public fieldStatic memberDTS_E_RAWMETADATACOUNTMISMATCHCannot append output file because the number of columns in the output file does not match the number of columns in this destination. The old file does not match in metadata.
Public fieldStatic memberDTS_E_RAWMETADATAMISMATCHCannot append output file because no column in the existing file matches column "%1" from the input. Old file does not match in metadata.
Public fieldStatic memberDTS_E_RAWMETADATAMISMATCHCODEPAGEThe output file cannot be appended. Column "%1" matches by name, but the column in the file has code page %2!d! and the input column has code page %3!d!. The metadata for the named column does not match on code page.
Public fieldStatic memberDTS_E_RAWMETADATAMISMATCHPRECISIONThe output file cannot be appended. Column "%1" matches by name, but the column in the file has precision %2!d! and the input column has precision %3!d!. The metadata for the named column does not match on precision.
Public fieldStatic memberDTS_E_RAWMETADATAMISMATCHSCALEThe output file cannot be appended. Column "%1" matches by name, but the column in the file has scale %2!d! and the input column has scale %3!d!. The metadata for the named column does not match on scale.
Public fieldStatic memberDTS_E_RAWMETADATAMISMATCHSIZEThe output file cannot be appended. Column "%1" matches by name, but the column in the file has maximum length %2!d! and the input column has maximum length %3!d!. The metadata for the column does not match in length.
Public fieldStatic memberDTS_E_RAWMETADATAMISMATCHTYPEThe output file cannot be appended. Column "%1" matches by name, but the column in the file has type %2 and the input column has type %3. The metadata for the column does not match on data type.
Public fieldStatic memberDTS_E_RAWNOLONGTYPESThe column %1 cannot be used. The raw adapters do not support image, text, or ntext data.
Public fieldStatic memberDTS_E_RAWREADFAILEDThe raw adapter attempted to read %1!d! bytes in the input file for column "%2" with lineage ID %3!d!, but there was an error. The error returned from the operating system should have been previously reported.
Public fieldStatic memberDTS_E_RAWSKIPFAILEDThe raw adapter attempted to skip %1!d! bytes in the input file for unreferenced column "%2" with lineage ID %3!d!, but there was an error. The error returned from the operating system should have been previously reported.
Public fieldStatic memberDTS_E_RAWSTRINGINPUTTOOLONGThe adapter was asked to write a string that was %1!I64d! bytes long, but all data must be less than 4294967295 bytes in length.
Public fieldStatic memberDTS_E_RAWSTRINGTOOLONGString too long. The adapter read a string that was %1!d! bytes long, and expected a string no longer than %2!d! bytes, at offset %3!d!. This could indicate a damaged input file. The file shows a string length that is too large for the buffer column.
Public fieldStatic memberDTS_E_RAWTOOMANYCOLUMNSThe source file is not valid. The source file is returning a count of more than 131,072 columns. This usually occurs when the source file is not produced by the raw file destination.
Public fieldStatic memberDTS_E_RAWUNEXPECTEDEOFUnexpected end-of-file encountered while reading %1!d! bytes from file "%2". The file ended prematurely because of an invalid file format.
Public fieldStatic memberDTS_E_RAWUNEXPECTEDTYPEThe adapter encountered an unrecognized data type of %1!d!. This could be caused by a damaged input file (source) or by an invalid buffer type (destination).
Public fieldStatic memberDTS_E_RAWVERSIONINCOMPATIBLEAPPENDThe output file was written by an incompatible version and cannot be appended. The file may be an older file format that is no longer useable.
Public fieldStatic memberDTS_E_READNOTFILLEDCACHEThe cache is being written to by __, and cannot be read by __.
Public fieldStatic memberDTS_E_READONLYSTOCKPROPERTYThe property is read-only.
Public fieldStatic memberDTS_E_READUNINITIALIZEDCACHEThe cache is not initialized and cannot be read by __.
Public fieldStatic memberDTS_E_READWRITECOLUMNMISSINGREQUIREDCUSTOMPROPERTYThe %1 is read/write and is required to have custom property "%2". Add the property, or make remove the read/write attribute from the column.
Public fieldStatic memberDTS_E_RECORDSETDESTDATATYPENOTSUPPORTEDThe data type of the __ is not supported for the __.
Public fieldStatic memberDTS_E_REDIRECTFAILUREThe specified server, URL %1, has a redirect and the redirect request failed.
Public fieldStatic memberDTS_E_REDIRECTROWUNAVAILABLEWITHFASTLOADANDZEROMAXINSERTCOMMITSIZEThe error row disposition on "%1" cannot be set to redirect the row when the fast load option is turned on, and the maximum insert commit size is set to zero.
Public fieldStatic memberDTS_E_REDUCTIONFAILEDThe Data Flow engine scheduler failed to reduce the execution plan for the pipeline. Set the OptimizedMode property to false.
Public fieldStatic memberDTS_E_REFERENCECOLUMNTOOWIDEThe code encountered a column that was too wide.
Public fieldStatic memberDTS_E_REFERENCEDMETADATABADCOUNTInput "%1" (%2!d!) references input "%3" (%4!d!), but they do not have the same number of columns. Input %5!d! has %6!d! columns, while input %7!d! has %8!d! columns.
Public fieldStatic memberDTS_E_REFID_CANNOT_FINDATTRIBUTEThe attribute specified in the reference identifier cannot be found.
Public fieldStatic memberDTS_E_REFID_CANNOT_FINDATTRIBUTESThe collection of attributes specified in the reference identifier cannot be found.
Public fieldStatic memberDTS_E_REFID_COULDNOTMAPREFIDThe reference identifier could not be mapped.
Public fieldStatic memberDTS_E_REFUSEDFORSHUTDOWNThis thread has shut down and is not accepting buffers for input.
Public fieldStatic memberDTS_E_REMOTEPACKAGEVALIDATIONPackage failed validation from the ExecutePackage task. The package cannot run.
Public fieldStatic memberDTS_E_REMOVEFOLDERFROMSQLSERVER_OLEDBThe RemoveFolderOnSQLServer method encountered OLE DB error code 0x%1!8.8X! (%2). The SQL statement issued has failed.
Public fieldStatic memberDTS_E_REMOVEFROMSQLSERVER_OLEDBThe RemoveFromSQLServer method encountered OLE DB error code 0x%1!8.8X! (%2) The SQL statement that was issued has failed.
Public fieldStatic memberDTS_E_RENAMEFOLDERONSQLSERVER_OLEDBThe RenameFolderOnSQLServer method encountered OLE DB error code 0x%1!8.8X! (%2). The SQL statement issued has failed.
Public fieldStatic memberDTS_E_REQUIREDBUFFERISNOTAVAILBLEA required buffer is not available.
Public fieldStatic memberDTS_E_RESERVEDNAMESPACEError assigning namespace to the variable. The namespace "System" is reserved for system use. This error happens when a component or task attempts to create a variable with a namespace of "System".
Public fieldStatic memberDTS_E_RETRIEVINGDEPENDENCIESA failure occurred on task "%1": 0x%2!8.8X! while retrieving dependencies. The runtime was retrieving dependencies from the task's dependencies collection when the error occurred. The task may have incorrectly implemented one of the dependency interfaces.
Public fieldStatic memberDTS_E_ROWCOUNTBADVARIABLENAMEThe variable "%1" specified by VariableName property is not a valid variable. Need a valid variable name to write to.
Public fieldStatic memberDTS_E_ROWCOUNTBADVARIABLETYPEThe variable "%1" specified by VariableName property is not an integer. Change the variable to be of type VT_I4, VT_UI4, VT_I8, or VT_UI8.
Public fieldStatic memberDTS_E_ROWSETUNAVAILABLEA row set based on the SQL command was not returned by the OLE DB provider.
Public fieldStatic memberDTS_E_RSTDESTBADVARIABLEThe value of the specified variable cannot be located, locked, or set.
Public fieldStatic memberDTS_E_RSTDESTBADVARIABLENAMEThe VariableName property is not set to the name of a valid variable. Need a runtime variable name to write to.
Public fieldStatic memberDTS_E_RSTDESTBADVARIABLETYPEThe type of the runtime variable "%1" is incorrect. The runtime variable type must be Object.
Public fieldStatic memberDTS_E_RSTDESTBIGBLOBA value in an input column is too large to be stored in the ADODB.Recordset object.
Public fieldStatic memberDTS_E_RSTDESTRSTCONFIGPROBLEMUnable to create or configure the ADODB.Recordset object.
Public fieldStatic memberDTS_E_RSTDESTRSTWRITEPROBLEMError writing to the ADODB.Recordset object.
Public fieldStatic memberDTS_E_RUNTIMEVARIABLETYPECHANGEThe type of the value being assigned to variable "%1" differs from the current variable type. Variables may not change type during execution. Variable types are strict, except for variables of type Object.
Public fieldStatic memberDTS_E_SAVE_PERSTFORMATFailed to save Data Flow objects. The specified format is not supported.
Public fieldStatic memberDTS_E_SAVEFILEFailed to save package file.
Public fieldStatic memberDTS_E_SAVEPACKAGEFILEFailed to save package file "%1" with error 0x%2!8.8X! "%3".
Public fieldStatic memberDTS_E_SAVETOSQLSERVER_OLEDBThe SaveToSQLServer method has encountered OLE DB error code 0x%1!8.8X! (%2). The SQL statement that was issued has failed.
Public fieldStatic memberDTS_E_SCHEDULERBADTREEThe Data Flow engine scheduler failed to retrieve the execution tree with index %1!d! from the layout. The scheduler received a count containing more execution trees than actually exist.
Public fieldStatic memberDTS_E_SCHEDULERCOULDNOTCOUNTDESTINATIONSThe Data Flow engine scheduler cannot obtain a count of the destinations in the layout.
Public fieldStatic memberDTS_E_SCHEDULERCOULDNOTCOUNTSOURCESThe Data Flow engine scheduler cannot obtain a count of the sources in the layout.
Public fieldStatic memberDTS_E_SCHEDULERMEMORYThe Data Flow engine scheduler cannot allocate enough memory for the execution structures. The system was low on memory before execution started.
Public fieldStatic memberDTS_E_SCHEDULEROBJECTThe Data Flow engine scheduler cannot retrieve object with ID %1!d! from the layout. The Data Flow engine scheduler previously located an object that is now no longer available.
Public fieldStatic memberDTS_E_SCHEDULERTHREADMEMORYThe Data Flow engine scheduler failed to create a thread object because not enough memory is available. This is caused by an out-of-memory condition.
Public fieldStatic memberDTS_E_SCRIPTMIGRATIONFAILED64BITMigration for VSA scripts cannot be done on 64 bit platforms due to lack of Visual Tools for Applications designer support. Run the migration under WOW64 on 64 bit platforms.
Public fieldStatic memberDTS_E_SCRIPTTASK_BINARYITEMNOTFOUNDEXCEPTIONBinary item "%1" was not found in the package.
Public fieldStatic memberDTS_E_SCRIPTTASK_CANTINITNULLTASKCannot initialize to a null task.
Public fieldStatic memberDTS_E_SCRIPTTASK_COMPILEERRORMSGError "%1": "%2"\r\nLine "%3" Column "%4" through "%5".
Public fieldStatic memberDTS_E_SCRIPTTASK_COMPILEERRORMSG2There was an error compiling the script: "%1".
Public fieldStatic memberDTS_E_SCRIPTTASK_COMPILEERRORMSG3Error "%1": "%2"\r\nLine "%3" Columns "%4"-"%5"\r\nLine Text: "%6".
Public fieldStatic memberDTS_E_SCRIPTTASK_COULDNOTCREATEENTRYPOINTCLASSCould not create an instance of entry point class "%1".
Public fieldStatic memberDTS_E_SCRIPTTASK_HOST_NAME_CANT_EMPTYName cannot be empty.
Public fieldStatic memberDTS_E_SCRIPTTASK_ILLEGALSCRIPTNAMEThe script name is not valid. It cannot contain spaces, slashes, special characters, or begin with a number.
Public fieldStatic memberDTS_E_SCRIPTTASK_INITIALIZATION_WITH_NULL_TASKUser interface initialization: The task is null.
Public fieldStatic memberDTS_E_SCRIPTTASK_INVALID_ENTRY_POINTEntry point not found.
Public fieldStatic memberDTS_E_SCRIPTTASK_INVALID_SCRIPT_LANGUAGEThe script language specified is not valid.
Public fieldStatic memberDTS_E_SCRIPTTASK_INVALID_SCRIPT_NAMEThe project name is not valid. It cannot contain spaces, slashes, special characters, or begin with a number.
Public fieldStatic memberDTS_E_SCRIPTTASK_INVALIDSCRIPTLANGUAGEThe script language specified is not valid.
Public fieldStatic memberDTS_E_SCRIPTTASK_LANGUAGE_EMPTYThe script language is not specified. Verify that a valid script language is specified.
Public fieldStatic memberDTS_E_SCRIPTTASK_LOADFROMXMLEXCEPTIONThere was an exception while loading Script Task from XML: "%1".
Public fieldStatic memberDTS_E_SCRIPTTASK_MUSTINITWITHRIGHTTASKThe Script Task user interface must initialize to a Script Task.
Public fieldStatic memberDTS_E_SCRIPTTASK_SCRIPTFILESFAILEDTOLOADUser script files failed to load.
Public fieldStatic memberDTS_E_SCRIPTTASK_SCRIPTREPORTEDFAILUREUser script returned a failure result.
Public fieldStatic memberDTS_E_SCRIPTTASK_SCRIPTTHREWEXCEPTIONUser script threw an exception: "%1".
Public fieldStatic memberDTS_E_SCRIPTTASK_SOURCEITEMNOTFOUNDEXCEPTIONSource item "%1" was not found in the package.
Public fieldStatic memberDTS_E_SCRIPTTASK_UI_INITIALIZATION_WITH_WRONG_TASKThe Script Task user interface is initialized with an incorrect task.
Public fieldStatic memberDTS_E_SCRIPTTASK_UNRECOGNIZEDSCRIPTLANGUAGEEXCEPTION"%1" was not recognized as a valid script language.
Public fieldStatic memberDTS_E_SCRIPTTASK_WASNOTINITEDThe Script Task user interface is not initialized.
Public fieldStatic memberDTS_E_SECUREFAILURESSL certificate response obtained from the server was not valid. Cannot process the request.
Public fieldStatic memberDTS_E_SEEKFAILEDThe buffer manager could not seek to offset %1!d! in file "%2". The file is damaged.
Public fieldStatic memberDTS_E_SENDMAILTASK_CHECK_VALID_SMTP_SERVERVerify that the Simple Mail Transfer Protocol (SMTP) server specified is valid.
Public fieldStatic memberDTS_E_SENDMAILTASK_CONNECTIONTYPENOTFILEConnection "%1" is not of type File.
Public fieldStatic memberDTS_E_SENDMAILTASK_CONNECTIONTYPENOTSMTPConnection "%1" is not of type SMTP.
Public fieldStatic memberDTS_E_SENDMAILTASK_CONNMNGRNULLConnection "%1" is empty.
Public fieldStatic memberDTS_E_SENDMAILTASK_FILEDOESNOTEXISTOn operation "%1", file "%2" does not exist.
Public fieldStatic memberDTS_E_SENDMAILTASK_INVALIDATTACHMENTEither the file "%1" does not exist or you do not have permissions to access the file.
Public fieldStatic memberDTS_E_SENDMAILTASK_NOCONNMNGRThe specified connection "%1" does not exist.
Public fieldStatic memberDTS_E_SENDMAILTASK_RECIPIENT_EMPTYNo recipient is specified.
Public fieldStatic memberDTS_E_SENDMAILTASK_SMTP_SERVER_NOT_SPECIFIEDThe Simple Mail Transfer Protocol (SMTP) server is not specified. Provide a valid name or IP address of the SMTP server.
Public fieldStatic memberDTS_E_SENDMAILTASK_TASK_INITIALIZATION_WITH_WRONG_XML_ELEMENTSend Mail task is initiated with an incorrect XML element.
Public fieldStatic memberDTS_E_SENDMAILTASK_VARIABLETYPEISNOTSTRINGVariable "%1" is not of type string.
Public fieldStatic memberDTS_E_SENSITIVEPARAMVALUENOTALLOWEDSensitive parameter value is not allowed from the server.
Public fieldStatic memberDTS_E_SERVERAUTHServer authentication failed. This error occurs when login credentials are not provided, or the credentials are incorrect.
Public fieldStatic memberDTS_E_SERVERSTORAGEDISALLOWEDThe protection level, ServerStorage, cannot be used when saving to this destination. The system could not verify that the destination supports secure storage capability.
Public fieldStatic memberDTS_E_SETCACHEFORFILLFAILEDFailed to mark the cache as filled with data.
Public fieldStatic memberDTS_E_SETCACHEFORINSERTFAILEDFailed to prepare the cache for new data.
Public fieldStatic memberDTS_E_SETCACHEFORREADFAILEDFailed to prepare the cache for providing data.
Public fieldStatic memberDTS_E_SETEODFAILEDFailure encountered while setting end of data flag for the buffer driving output "%1" (%2!d!).
Public fieldStatic memberDTS_E_SETPERSIST_PROPEVENTSFailed to set the XML persistence events property for the Data Flow objects.
Public fieldStatic memberDTS_E_SETPERSIST_XMLDOMFailed to set the persistence XML DOM property for the Data Flow objects.
Public fieldStatic memberDTS_E_SETPERSIST_XMLNODEFailed to set the persistence XML ELEMENT property for the Data Flow objects.
Public fieldStatic memberDTS_E_SETPERSISTPROP_FAILEDFailed to set xml persistence properties for the Data Flow objects.
Public fieldStatic memberDTS_E_SETQUALIFIERDESIGNTIMEONLYThe SetQualifier method cannot be called on a connection manager during package execution. This method is used at design-time only.
Public fieldStatic memberDTS_E_SETRESULTCOLUMNFAILEDAttempting to set the result column for the expression "%1" on %2 failed with error code 0x%3!8.8X!. The input or output column that was to receive the result of the expression cannot be determined, or the expression result cannot be cast to the column type.
Public fieldStatic memberDTS_E_SIGNATURENOTPRESENTThe package is not signed.
Public fieldStatic memberDTS_E_SIGNATUREPOLICYVIOLATIONThe package cannot be loaded because the state of the digital signature violates signature policy. Error 0x%1!8.8X! "%2".
Public fieldStatic memberDTS_E_SIGNPACKAGEFAILEDPackage signing failed with error 0x%1!8.8X! "%2". This occurs when the ManagedHelper.SignDocument method fails.
Public fieldStatic memberDTS_E_SORTBADTHREADCOUNTMaxThreads was %1!ld!, and should be between 1 and %2!ld!, inclusive or -1 to default to the number of CPUs.
Public fieldStatic memberDTS_E_SORTCANTCOMPAREThe Sort transformation failed to compare row %1!d! in buffer ID %2!d! to row %3!d! in buffer ID %4!d!.
Public fieldStatic memberDTS_E_SORTCANTCREATEEVENTThe Sort transformation cannot create an event to communicate with its worker threads. Not enough system handles are available to the Sort transformation.
Public fieldStatic memberDTS_E_SORTCANTCREATETHREADThe Sort transformation cannot create a worker thread. Not enough memory is available to Sort transformation.
Public fieldStatic memberDTS_E_SORTDUPLICATEKEYWEIGHTBoth column "%1" (%2!d!) and column "%3" (%4!d!) were marked with sort key weight %5!d!.
Public fieldStatic memberDTS_E_SORTEDOUTPUTHASINVALIDSORTKEYPOSITION"%1" has a non-zero SortKeyPosition, but its value (%2!ld!) is too large. It must be less than or equal to the number of columns.
Public fieldStatic memberDTS_E_SORTEDOUTPUTHASINVALIDSORTKEYPOSITIONSThe IsSorted property of %1 is set to TRUE, but the absolute values of the non-zero output column SortKeyPositions do not form a monotonically increasing sequence, starting at one.
Public fieldStatic memberDTS_E_SORTNEEDSONEKEYAt least one input column must be marked as a sort key, but no keys were found.
Public fieldStatic memberDTS_E_SORTSTACKOVERFLOWThe sort failed due to a stack overflow while sorting an incoming buffer. Please reduce the DefaultBufferMaxRows property on the Data Flow Task.
Public fieldStatic memberDTS_E_SORTTHREADSTOPPEDA worker thread in the Sort transformation stopped with error code 0x%1!8.8X!. A catastrophic error was encountered while sorting a buffer.
Public fieldStatic memberDTS_E_SOURCETABLENAMENOTPROVIDEDA source table name has not been provided.
Public fieldStatic memberDTS_E_SPLITEXPRESSIONNOTBOOLEANThe expression "%1" is not Boolean. The result type of the expression must be Boolean.
Public fieldStatic memberDTS_E_SQLCEDESTDATATYPENOTSUPPORTEDThe data type "__" found on column "__" is not supported for the __.
Public fieldStatic memberDTS_E_SQLCEDESTSTATIC_FAILEDTOINSERTThe SQLCE destination could not insert the row.
Public fieldStatic memberDTS_E_SQLCEDESTSTATIC_FAILEDTOSETVALUESThe SQLCE destination could not set the column values for the row.
Public fieldStatic memberDTS_E_SQLPERSISTENCEVERSIONStoring packages in SQL Server requires database server version 9.0 or higher. Storing packages in SQL Server is not supported on earlier versions of servers.
Public fieldStatic memberDTS_E_SQLPROFILERDLL_ONLY_X86The log provider for SQL Server Profiler was unable to load pfclnt.dll because it is only supported on 32-bit systems.
Public fieldStatic memberDTS_E_SQLTASK_CANNOTACQUIRECONNMANAGERCannot acquire a connection from the connection manager.
Public fieldStatic memberDTS_E_SQLTASK_CANNOTLOCATECONNMANAGERConnection manager "%1" does not exist.
Public fieldStatic memberDTS_E_SQLTASK_CONNECTIONTYPENOTFILEConnection "%1" is not a file connection manager.
Public fieldStatic memberDTS_E_SQLTASK_DATETRUNCATIONDate truncation connection.
Public fieldStatic memberDTS_E_SQLTASK_ERRORASSIGINGVALUETOVARAn error occurred while assigning a value to variable "%1": "%2".
Public fieldStatic memberDTS_E_SQLTASK_ERROREXECUTINGTHEQUERYExecuting the query "%1" failed with the following error: "%2". Possible failure reasons: Problems with the query, "ResultSet" property not set correctly, parameters not set correctly, or connection not established correctly.
Public fieldStatic memberDTS_E_SQLTASK_FAILEDTOACQUIRECONNECTIONFailed to acquire connection "%1". Connection may not be configured correctly or you may not have the right permissions on this connection.
Public fieldStatic memberDTS_E_SQLTASK_FILEDOESNOTEXISTFile represented by "%1" does not exist.
Public fieldStatic memberDTS_E_SQLTASK_INDESNOTINCOLLECTIONThe index is not assigned in this collection.
Public fieldStatic memberDTS_E_SQLTASK_INVALIDEPARAMDIRECTIONFALGThe parameter directions flag is not valid.
Public fieldStatic memberDTS_E_SQLTASK_INVALIDNUMOFRESULTBINDINGSThere is an invalid number of result bindings returned for the ResultSetType: "%1".
Public fieldStatic memberDTS_E_SQLTASK_INVALIDPARAMETERNAMEThe parameter name is not valid.
Public fieldStatic memberDTS_E_SQLTASK_MULTIPLERETURNVALUEPARAMA parameter with type return value is not the first parameter, or there are more than one parameter of type return value.
Public fieldStatic memberDTS_E_SQLTASK_NOCONNECTIONMANAGERNo connection manager is specified.
Public fieldStatic memberDTS_E_SQLTASK_NOHANDLERFORCONNECTIONCannot locate a handler for the specified connection type.
Public fieldStatic memberDTS_E_SQLTASK_NOSQLTASKDATAINXMLFRAGMENTThe XML fragment does not contain SQL Task data.
Public fieldStatic memberDTS_E_SQLTASK_NOSTATEMENTSPECIFIEDNo Transact-SQL statement specified.
Public fieldStatic memberDTS_E_SQLTASK_NOXMLSUPPORTThe connection does not support XML result sets.
Public fieldStatic memberDTS_E_SQLTASK_NULLPARAMETERNAMECannot have a null parameter name.
Public fieldStatic memberDTS_E_SQLTASK_OBJECTNOTINCOLLECTIONThe object does not exist in this collection.
Public fieldStatic memberDTS_E_SQLTASK_ODBCNOSUPPORTTRANSACTIONThe task has a transaction option of "Required" and connection "%1" is of type "ODBC". ODBC connections don't support transactions.
Public fieldStatic memberDTS_E_SQLTASK_PARAMSIZEERRORParameter "%1" cannot be negative. (-1) is used for the default value.
Public fieldStatic memberDTS_E_SQLTASK_READONLYVARIABLEVariable "%1" cannot be used in a result binding because it is read-only.
Public fieldStatic memberDTS_E_SQLTASK_RESULTBINDTYPEFORROWSETXMLThe result binding name must be set to zero for full result set and XML results.
Public fieldStatic memberDTS_E_SQLTASK_RESULTBYNAMENOTSUPPORTEDResult binding by name "%1" is not supported for this connection type.
Public fieldStatic memberDTS_E_SQLTASK_ROVARINOUTPARAMETERThe variable "%1" cannot be used as an "out" parameter or return value in a parameter binding because it is read-only.
Public fieldStatic memberDTS_E_SQLTASK_TYPECONVERSIONERRORError converting the type from the connection.
Public fieldStatic memberDTS_E_SQLTASK_TYPEISNOTCONVERTABLEThe connection type is not convertible.
Public fieldStatic memberDTS_E_SQLTASK_UNABLETOACQUIREMANAGEDCONNCannot acquire a managed connection.
Public fieldStatic memberDTS_E_SQLTASK_VALIDPARAMETERTYPESValid parameter names are of type Integer or String.
Public fieldStatic memberDTS_E_SQLTASK_VARIABLENOTFOUNDVariable "%1" does not exist or could not be locked.
Public fieldStatic memberDTS_E_SQLTASK_VARIABLETYPEISNOTSTRINGType of variable "%1" is not string.
Public fieldStatic memberDTS_E_SQLTASKCONN_ERR_CANT_LOAD_XMLCannot load XML with query result.
Public fieldStatic memberDTS_E_SQLTASKCONN_ERR_NO_DISCONNECTED_RSNo disconnected record set is available for the Transact-SQL statement.
Public fieldStatic memberDTS_E_SQLTASKCONN_ERR_NO_ROWSA result set type of single row is specified, but no rows were returned.
Public fieldStatic memberDTS_E_SQLTASKCONN_ERR_NOROWSETNo result rowset is associated with the execution of this query.
Public fieldStatic memberDTS_E_SQLTASKCONN_ERR_ODBC_DISCONNECTEDDisconnected record sets are not available from ODBC connections.
Public fieldStatic memberDTS_E_SQLTASKCONN_ERR_PARAM_DIRThe parameter direction on parameter binding \"%s\" is not valid.
Public fieldStatic memberDTS_E_SQLTASKCONN_ERR_PARAM_NAME_MIXParameter names cannot be an mix of ordinal and named types.
Public fieldStatic memberDTS_E_SQLTASKCONN_ERR_RESULT_COL_INDEXThe result column index %d is not valid.
Public fieldStatic memberDTS_E_SQLTASKCONN_ERR_RESULT_DATA_TYPEThe data type on result set binding \"%s\" is not supported.
Public fieldStatic memberDTS_E_SQLTASKCONN_ERR_RESULT_SET_DATA_TYPEThe data type in the result set, column %hd, is not supported.
Public fieldStatic memberDTS_E_SQLTASKCONN_ERR_UNKNOWN_RESULT_COLCannot find column \"%s\" in the result set.
Public fieldStatic memberDTS_E_SQLTASKCONN_ERR_UNKNOWN_TYPEUnknown type.
Public fieldStatic memberDTS_E_SQLTASKCONN_ERR_UNSUPPORTED_TYPEUnsupported type.
Public fieldStatic memberDTS_E_SQLTASKOUTPUTENCODINGNOTSUPPORTEDUnable to obtain XML data from SQL Server as Unicode because the provider does not support the OUTPUTENCODING property.
Public fieldStatic memberDTS_E_SSISSTANDALONENOTINSTALLEDTo run a SSIS package outside of Business Intelligence Development Studio you must install %1 of Integration Services or higher.
Public fieldStatic memberDTS_E_STOREDPROCSTASK_EMPTYSOURCELISTThere are no stored procedures to transfer.
Public fieldStatic memberDTS_E_STOREDPROCSTASK_ERRORSTOREDPROCEDUREEXISTSStored procedure "%1" already exists at destination server.
Public fieldStatic memberDTS_E_STOREDPROCSTASK_FAILEDTOTRANSFERSPSFailed to transfer the stored procedure(s). More informative error should have been raised.
Public fieldStatic memberDTS_E_STOREDPROCSTASK_OVERWRITINGSPATDESTINATIONOverwriting Stored Procedure "%1" at destination.
Public fieldStatic memberDTS_E_STOREDPROCSTASK_STOREDPROCNOTFOUNDStored Procedure "%1" is not found at the source.
Public fieldStatic memberDTS_E_STRINGCONVERSIONTOOLONGA string was too long to be converted.
Public fieldStatic memberDTS_E_SYNCHRONOUSIDMISMATCHThe SynchronousInputID property on "%1" was %2!d!, and %3!d! was expected.
Public fieldStatic memberDTS_E_TASKEXECUTEFAILEDThe Execute method on the task returned error code 0x%1!8.8X! (%2). The Execute method must succeed, and indicate the result using an "out" parameter.
Public fieldStatic memberDTS_E_TASKISEMPTYThe task has failed to load. The contact information for this task is "%1".
Public fieldStatic memberDTS_E_TASKPRODUCTLEVELThe task "%1" cannot run on installed %2 of Integration Services. It requires %3 or higher.
Public fieldStatic memberDTS_E_TASKVALIDATIONERRORThere were errors during task validation.
Public fieldStatic memberDTS_E_TASKVALIDATIONFAILEDThe Validate method on the task failed, and returned error code 0x%1!8.8X! (%2). The Validate method must succeed and indicate the result using an "out" parameter.
Public fieldStatic memberDTS_E_TERMEXTRACTION_ADDWORDTODECODERAn error occurred while adding words to a statistical decoder. The error code returned was 0x%1!8.8X!.
Public fieldStatic memberDTS_E_TERMEXTRACTION_COUNTTERMAn error occurred while counting term candidates. The error code returned was 0x%1!8.8X!.
Public fieldStatic memberDTS_E_TERMEXTRACTION_DECODEAn error occurred while decoding for a sentence. The error code returned was 0x%1!8.8X!.
Public fieldStatic memberDTS_E_TERMEXTRACTION_EMPTYTERMRESULTERRORAn error occurred while reclaiming the buffer used for caching terms. The error code returned was 0x%1!8.8X!.
Public fieldStatic memberDTS_E_TERMEXTRACTION_EXCEED_MAXWORDNUMThe Term Extraction transformation is unable to process the input text because a sentence from the input text is too long. The sentence is segmented into several sentences.
Public fieldStatic memberDTS_E_TERMEXTRACTION_INCORRECTDATATYPEOFINPUTCOLUMNThe input column can only have DT_WSTR or DT_NTEXT as its data type.
Public fieldStatic memberDTS_E_TERMEXTRACTION_INCORRECTDATATYPEOFOUTPUTCOLUMNThe output column [%1!d!] can only have '%2' as its data type.
Public fieldStatic memberDTS_E_TERMEXTRACTION_INCORRECTDATATYPEOFREFERENCECOLUMNThe reference column can only have DT_STR or DT_WSTR as its data type.
Public fieldStatic memberDTS_E_TERMEXTRACTION_INCORRECTEXACTNUMBEROFINPUTCOLUMNSThere should be only one input column.
Public fieldStatic memberDTS_E_TERMEXTRACTION_INCORRECTEXACTNUMBEROFOUTPUTCOLUMNSThere should be exactly two output columns.
Public fieldStatic memberDTS_E_TERMEXTRACTION_INCORRECTFREQUENCYTHRESHOLDThe value of Frequency Threshold should not be lower than '%1!d!'.
Public fieldStatic memberDTS_E_TERMEXTRACTION_INCORRECTMAXLENOFTERMThe value of Max Length of Term should not be lower than '%1!d!'.
Public fieldStatic memberDTS_E_TERMEXTRACTION_INCORRECTSCORETYPEThe Score Type of the transformation can only be Frequency or TFIDF.
Public fieldStatic memberDTS_E_TERMEXTRACTION_INCORRECTTERMTYPEThe Term Type of the transformation can only be WordOnly, PhraseOnly or WordPhrase.
Public fieldStatic memberDTS_E_TERMEXTRACTION_INITFSAAn error occurred while loading the finite state automata. The error code returned was 0x%1!8.8X!.
Public fieldStatic memberDTS_E_TERMEXTRACTION_INITIALIZEAn error occurred while initializing the engine of Term Extraction. The error code returned was 0x%1!8.8X!.
Public fieldStatic memberDTS_E_TERMEXTRACTION_INITPOSPROCESSORAn error occurred while initializing the part-of-speech processor. The error code returned was 0x%1!8.8X!.
Public fieldStatic memberDTS_E_TERMEXTRACTION_INITPOSTAGVECTORAn error occurred while initializing the part-of-speech processor. The error code returned was 0x%1!8.8X!.
Public fieldStatic memberDTS_E_TERMEXTRACTION_INVALIDOUTTERMTABLEORCOLUMNThe reference table, view, or column that is used for Exclusion Terms is not valid.
Public fieldStatic memberDTS_E_TERMEXTRACTION_MAINWORKSPACE_CREATEERRAn error occurred while creating a workspace buffer.
Public fieldStatic memberDTS_E_TERMEXTRACTION_MALLOCERR_REFERENCECOLUMNINFOAn error occurred while allocating memory.
Public fieldStatic memberDTS_E_TERMEXTRACTION_OLEDBERR_CREATEBINDINGAn OLEDB error occurred while creating bindings.
Public fieldStatic memberDTS_E_TERMEXTRACTION_OLEDBERR_FILLBUFFERAn OLEDB error occurred while populating internal cache.
Public fieldStatic memberDTS_E_TERMEXTRACTION_OLEDBERR_GETIROWSETAn OLEDB error occurred while fetching row sets.
Public fieldStatic memberDTS_E_TERMEXTRACTION_OUTTERMTABLEANDCOLUMNNOTSETThe reference table, view, or column to be used for an Exclusion Terms has not been set.
Public fieldStatic memberDTS_E_TERMEXTRACTION_PROCESSDOCUMENTAn error occurred while processing a document in the input. The error code returned was 0x%1!8.8X!.
Public fieldStatic memberDTS_E_TERMEXTRACTION_PROCESSERRAn error occurred while extracting terms on row %1!ld!, column %2!ld!. The error code returned was 0x%3!8.8X!. Please remove it from the input as a work-around.
Public fieldStatic memberDTS_E_TERMEXTRACTION_PROCESSSENTENCEAn error occurred while processing within a sentence. The error code returned was 0x%1!8.8X!.
Public fieldStatic memberDTS_E_TERMEXTRACTION_SAVEPOSTAGAn error occurred while saving part-of-speech tags from an internal buffer. The error code returned was 0x%1!8.8X!.
Public fieldStatic memberDTS_E_TERMEXTRACTION_SAVEPTRSTRINGAn error occurred while adding strings to an internal buffer. The error code returned was 0x%1!8.8X!.
Public fieldStatic memberDTS_E_TERMEXTRACTION_SETEXCLUDEDTERMAn error occurred while setting exclusion terms. The error code returned was 0x%1!8.8X!.
Public fieldStatic memberDTS_E_TERMEXTRACTION_STDLENGTHERRORAn std::length_error occurred from the STL containers.
Public fieldStatic memberDTS_E_TERMEXTRACTION_TERMFILTERSTARTITERATIONERRORAn error occurred while the Term Filter was starting its iteration.
Public fieldStatic memberDTS_E_TERMEXTRACTION_TOOFEWREFERENCECOLUMNSTerm Extraction reference metadata contains too few columns.
Public fieldStatic memberDTS_E_TERMEXTRACTION_UNABLETOLOCATEREFCOLUMNAn error occurred while locating the reference column '%1'.
Public fieldStatic memberDTS_E_TERMEXTRACTIONORLOOKUP_NTEXTSPLITEDFailed to locate the ending boundary of a sentence.
Public fieldStatic memberDTS_E_TERMEXTRACTIONORLOOKUP_PROCESSERR_DEPOSITFULLThe number of the term candidates exceeds its limit, 4G.
Public fieldStatic memberDTS_E_TERMEXTRACTIONORLOOKUP_TESTOFFSETERRORAn error occurred while normalizing words.
Public fieldStatic memberDTS_E_TERMLOOKUP_ADDREFERENCETERMAn error occurred while processing the %1!ld!th reference term. The error code returned was 0x%2!8.8X!. Please remove the reference term from your reference table as a work-around.
Public fieldStatic memberDTS_E_TERMLOOKUP_COUNTTERMAn error occurred while counting term candidates. The error code returned was 0x%1!8.8X!.
Public fieldStatic memberDTS_E_TERMLOOKUP_ENGINEADDREFERENCETERMAn error occurred while setting reference terms. The error code returned was 0x%1!8.8X!.
Public fieldStatic memberDTS_E_TERMLOOKUP_INCORRECTDATATYPEOFREFERENCECOLUMNThe reference column can only have DT_STR or DT_WSTR as its data type.
Public fieldStatic memberDTS_E_TERMLOOKUP_INCORRECTEXACTNUMBEROFTEXTCOLUMNSThere should be exactly one input column mapped to one reference column.
Public fieldStatic memberDTS_E_TERMLOOKUP_INITIALIZEAn error occurred while initializing the engine of Term Lookup. The error code returned was 0x%1!8.8X!.
Public fieldStatic memberDTS_E_TERMLOOKUP_INVALIDREFERENCETERMTABLEORCOLUMNThe reference table/view or column used for the reference terms is invalid.
Public fieldStatic memberDTS_E_TERMLOOKUP_MAINWORKSPACE_CREATEERRAn error occurred while creating a workspace buffer.
Public fieldStatic memberDTS_E_TERMLOOKUP_OLEDBERR_CREATEBINDINGAn OLEDB error occurred while creating bindings.
Public fieldStatic memberDTS_E_TERMLOOKUP_OLEDBERR_FILLBUFFERAn OLEDB error occurred while populating internal cache.
Public fieldStatic memberDTS_E_TERMLOOKUP_OLEDBERR_GETIROWSETAn OLEDB error occurred while fetching row sets.
Public fieldStatic memberDTS_E_TERMLOOKUP_PROCESSDOCUMENTAn error occurred while processing a document in the input. The error code returned was 0x%1!8.8X!.
Public fieldStatic memberDTS_E_TERMLOOKUP_PROCESSERRAn error occurred while looking up terms on row %1!ld!, column %2!ld!. The error code returned was 0x%3!8.8X!. Please remove it from the input as a work-around.
Public fieldStatic memberDTS_E_TERMLOOKUP_PROCESSSENTENCEAn error occurred while processing sentences. The error code returned was 0x%1!8.8X!.
Public fieldStatic memberDTS_E_TERMLOOKUP_REFERENCETERMTABLEANDCOLUMNNOTSETThe reference table/view or column used for the reference terms has not been set.
Public fieldStatic memberDTS_E_TERMLOOKUP_SAVEWORDWITHPUNCTERRORAn error occurred while saving words with punctuation characters. The error code returned was 0x%1!8.8X!.
Public fieldStatic memberDTS_E_TERMLOOKUP_SORREFERENCETERMAn error occurred while sorting reference terms. The error code returned was 0x%1!8.8X!.
Public fieldStatic memberDTS_E_TERMLOOKUP_TEXTIDINPUTCOLUMNNOTMAPPEDWITHOUTPUTCOLUMNAt least one Pass through column is not mapped to an output column.
Public fieldStatic memberDTS_E_TERMLOOKUP_TEXTINPUTCOLUMNHAVEINCORRECTDATATYPEThe input column mapped to a reference column can only have DT_NTXT or DT_WSTR as its data type.
Public fieldStatic memberDTS_E_TERMLOOKUP_TOOFEWOUTPUTCOLUMNSTerm Lookup contains too few output columns.
Public fieldStatic memberDTS_E_TERMLOOKUP_TOOFEWREFERENCECOLUMNSTerm Lookup reference metadata contains too few columns.
Public fieldStatic memberDTS_E_TERMLOOKUP_UNABLETOLOCATEREFCOLUMNAn error occurred while locating the reference column '%1'.
Public fieldStatic memberDTS_E_TEXTDATATYPENOTSUPPORTEDWITHUNICODEFILESThe data type for "%1" is DT_TEXT, which is not supported with Unicode files. Use DT_NTEXT instead and convert the data to DT_TEXT using the data conversion component.
Public fieldStatic memberDTS_E_TEXTMININGBASE_APPENDTOTEMPBUFFERAn error occurred while adding strings to an internal buffer. The error code returned was 0x%1!8.8X!.
Public fieldStatic memberDTS_E_TEXTMININGBASE_TESTPERIODAn error occurred while testing whether a dot is a part of an acronym. The error code returned was 0x%1!8.8X!.
Public fieldStatic memberDTS_E_TEXTQUALIFIERNOTFOUNDThe text qualifier for column "%1" cannot be found.
Public fieldStatic memberDTS_E_THREADCANCELLEDSSIS Error Code DTS_E_THREADCANCELLED. Thread "%1" received a shutdown signal and is terminating. The user requested a shutdown, or an error in another thread is causing the pipeline to shut down. There may be error messages posted before this with more information on why the thread was cancelled.
Public fieldStatic memberDTS_E_THREADCOUNTOUTOFRANGEThe EngineThreads property of the Data Flow task must be between %1!d! and %2!d!. An attempt was made to set the property to a value that is too small.
Public fieldStatic memberDTS_E_THREADFAILEDSSIS Error Code DTS_E_THREADFAILED. Thread "%1" has exited with error code 0x%2!8.8X!. There may be error messages posted before this with more information on why the thread has exited.
Public fieldStatic memberDTS_E_THREADFAILEDCREATEThe Data Flow task failed to create a required thread and cannot begin running. The usually occurs when there is an out-of-memory state.
Public fieldStatic memberDTS_E_THREADFAILEDINITIALIZEThe Data Flow task failed to initialize a required thread and cannot begin execution. The thread previously reported a specific error.
Public fieldStatic memberDTS_E_THREADSTARTUPFAILEDThe Data Flow task engine failed at startup because it cannot create one or more required threads.
Public fieldStatic memberDTS_E_TIMEGENCANTCONFIGUREUnable to configure the Microsoft.AnalysisServices.TimeDimGenerator.
Public fieldStatic memberDTS_E_TIMEGENCANTCONVERTUnsupported data type for column %1!d!.
Public fieldStatic memberDTS_E_TIMEGENCANTCREATEUnable to create the Microsoft.AnalysisServices.TimeDimGenerator.TimeDimGenerator.
Public fieldStatic memberDTS_E_TIMEGENCANTREADThe attempt to read from the Microsoft.AnalysisServices.TimeDimGenerator failed with error code 0x%1!8.8X!.
Public fieldStatic memberDTS_E_TIMEGENCANTREADCOLUMNThe attempt to read column "%2!d!" data from the Microsoft.AnalysisServices.TimeDimGenerator failed with error code 0x%2!8.8X!.
Public fieldStatic memberDTS_E_TIMEOUTThe request has timed out. This error can occur when the timeout specified was too short, or a connection to the server or proxy cannot be established. Ensure that the server and proxy URL are correct.
Public fieldStatic memberDTS_E_TKEXECPACKAGE_CREATECHILDPKGFAILEDFailure creating child package.
Public fieldStatic memberDTS_E_TKEXECPACKAGE_DOMDOCUMENTFAILEDFailure documenting DOM.
Public fieldStatic memberDTS_E_TKEXECPACKAGE_DOMPROPFAILEDFailure accessing the DOM property.
Public fieldStatic memberDTS_E_TKEXECPACKAGE_FILEACCESSERRORError while accessing package file.
Public fieldStatic memberDTS_E_TKEXECPACKAGE_INCORRECTCONNECTIONMANAGERTYPEThe connection manager "%1" has an unsupported type "%2". Only "FILE" and "OLEDB" connection managers are supported.
Public fieldStatic memberDTS_E_TKEXECPACKAGE_NOPROJECTREFERENCEThe package has no project reference.
Public fieldStatic memberDTS_E_TKEXECPACKAGE_PACKAGENOTEXISTThe package from the connection does not exist.
Public fieldStatic memberDTS_E_TKEXECPACKAGE_REQUIREDPARAMETERNOTSPECIFIEDThe required parameter is not specified from the connection.
Public fieldStatic memberDTS_E_TKEXECPACKAGE_REQUIRESENSITIVEPARAMETERThe package requires sensitive parameter.
Public fieldStatic memberDTS_E_TKEXECPACKAGE_SERVERNAMEFAILEDThe server name failed.
Public fieldStatic memberDTS_E_TKEXECPACKAGE_SQLLOADFAILEDFailure loading SQL server.
Public fieldStatic memberDTS_E_TKEXECPACKAGE_UNABLETOLOADError 0x%1!8.8X! while preparing to load the package. %2.
Public fieldStatic memberDTS_E_TKEXECPACKAGE_UNABLETOLOADFILEError 0x%1!8.8X! while loading package file "%3". %2.
Public fieldStatic memberDTS_E_TKEXECPACKAGE_UNABLETOLOADXMLError 0x%1!8.8X! while loading package file "%3" into an XML document. %2.
Public fieldStatic memberDTS_E_TKEXECPACKAGE_UNSPECIFIEDCONNECTIONThe connection is not specified.
Public fieldStatic memberDTS_E_TKEXECPACKAGE_UNSPECIFIEDPACKAGEThe package is not specified.
Public fieldStatic memberDTS_E_TKEXECPACKAGE_USERNAMEFAILEDThe package username failed to access.
Public fieldStatic memberDTS_E_TKEXECPACKAGE_VARIABLENOTFOUNDPackage variable not found from the connection.
Public fieldStatic memberDTS_E_TOEXECISNOTCHILDWhen adding a precedence constraint, the To executable specified is not a child of this container.
Public fieldStatic memberDTS_E_TOTALINPUTCOLSCANNOTBEZERONo input columns found. At least one input column must be mapped to an output column.
Public fieldStatic memberDTS_E_TRANSACTIONError transaction.
Public fieldStatic memberDTS_E_TRANSACTIONENLISTNOTSUPPORTEDThe connection does not support enlisting in distributed transaction.